{"text_format":"1","workbook":"xlsx","n_sheets":10,"sheets":["Perfis I-H Laminados","Ligação Soldada Viga-Pilar","Ligação Chapa de Cabeça","Placa de Base 1","Placa de Base 2","Placa de Base 3","Placa de Base 4","Calcular Lista","Tabela de Perfis","Aços"],"not_rendered":{"charts":4,"images":11,"macros":1,"external_links":0,"defined_names":27,"comments":1,"pivot_tables":0},"unopened":[],"bounds":{"document_bytes":16777216,"sheet_cells":100000,"rows_first":2000,"rows_last":500,"rows_between":2000,"halvings":0,"cell_chars":16384,"cell_head_chars":4096},"cells_cut":0,"cells_raw":0,"read":"whole","date_system":"1900"}

{"sheet":"Perfis I-H Laminados","index":0,"n_rows":83,"n_cols":20,"rows_kept":83,"cut":false,"hidden":false,"merged":[[53,1,53,2],[53,3,53,4],[60,1,60,2],[60,3,60,4],[65,1,65,2],[65,3,65,4],[43,1,43,2],[43,3,43,4],[45,1,45,2],[45,3,45,4],[48,1,48,2],[48,3,48,4],[38,1,38,2],[38,3,38,4],[0,1,1,15],[5,8,5,11],[6,1,6,2],[6,6,6,11],[18,1,18,2],[19,1,19,2],[31,1,31,2],[31,3,31,4],[36,1,36,2],[36,3,36,4],[22,1,24,2]]}
[null,"Dimensionamento de Perfis I e H Laminados Padrão Açominas"]
[]
[]
[]
[]
[null,null,null,null,null,null,"Resultado:",null,{"$f":"MAX(J17,J18,J22,J26,J30,J34,J38,J42,J49)","v":0.68513217408347227}]
[null,"Esforços e Distâncias",null,null,null,null,"W 200 x 15,0",null,null,null,null,null,null,null,null,null,null,"Perfil","Peso","%"]
[null,"Lx (mm)",6000,null,null,null,"d(mm)",{"$f":"VLOOKUP(G7,'Tabela de Perfis'!A:C,3,0)","v":200},"Wx(cm³)",{"$f":"VLOOKUP(G7,'Tabela de Perfis'!A:R,12,0)","v":130.5},"rx(cm)",{"$f":"VLOOKUP(G7,'Tabela de Perfis'!A:N,13,0)","v":8.1999999999999993},null,null,null,null,null,"W 310 x 23,8",23.8,0.95017735035431372]
[null,"Ly (mm)",2000,null,null,null,"bf(mm)",{"$f":"VLOOKUP(G7,'Tabela de Perfis'!A:D,4,0)","v":100},"Wy(cm³)",{"$f":"VLOOKUP(G7,'Tabela de Perfis'!A:R,16,0)","v":17.399999999999999},"ry(cm)",{"$f":"VLOOKUP(G7,'Tabela de Perfis'!A:R,17,0)","v":2.12},null,null,null,null,null,"W 250 x 25,3",25.3,0.97950763196061608]
[null,"N(kN)",-11.7,null,null,null,"d'(mm)",{"$f":"VLOOKUP(G7,'Tabela de Perfis'!A:H,8,0)","v":170},"Zx(cm³)",{"$f":"VLOOKUP(G7,'Tabela de Perfis'!A:N,14,0)","v":147.9},"Área(cm²)",{"$f":"VLOOKUP(G7,'Tabela de Perfis'!A:I,9,0)","v":19.399999999999999},null,null,null,null,null,"W 310 x 28,3",28.3,0.74893971593661812]
[null,"Vx(kN)",0,null,null,null,"tw(mm)",{"$f":"VLOOKUP(G7,'Tabela de Perfis'!A:F,5,0)","v":4.3},"Zy(cm³)",{"$f":"VLOOKUP(G7,'Tabela de Perfis'!A:R,18,0)","v":27.3},"ho/tw",{"$f":"H10/H11","v":39.534883720930232},"Limite:",{"$f":"1.49*SQRT(20500/C21)","v":36.32065328532051},null,{"$f":"IF(L11<N11,\"Compacta\",\"Esbelta\")","v":"Esbelta"},null,"W 250 x 28,4",28.4,0.84355772202947832]
[null,"Vy(kN)",32.700000000000003,null,null,null,"tf(mm)",{"$f":"VLOOKUP(G7,'Tabela de Perfis'!A:F,6,0)","v":5.2},"Ix(cm4)",{"$f":"VLOOKUP(G7,'Tabela de Perfis'!A:R,11,0)","v":1305},"b/tf",{"$f":"(H9/2)/H12","v":9.615384615384615},"Limite:",{"$f":"0.56*SQRT(20500/C21)","v":13.650715328711065},{"$f":"1.03*SQRT(20500/C21)","v":25.10756569387928},{"$f":"IF(L12>O12,\"Esbelta\",IF(L12<N12,\"Compacta\",\"semicompacta\"))","v":"Compacta"},null,"W 200 x 31,3",31.3,0.83913780363618118]
[null,"Mx(kN.cm)",2355,null,null,null,"h(mm)",{"$f":"H8-2*H12","v":189.6},"Iy(cm4)",{"$f":"VLOOKUP(G7,'Tabela de Perfis'!A:R,15,0)","v":87},"Peso (kg/m)",{"$f":"VLOOKUP(G7,'Tabela de Perfis'!A:B,2,0)","v":15},null,null,null,null,null,"W 250 x 32,7",32.700000000000003,0.66301193879917264]
[null,"My(kN.cm)",0,null,null,null,null,null,null,null,null,null,null,null,null,null,null,"W 310 x 32,7",32.700000000000003,0.62878890773878149]
[null,"kx",1,null,null,null,"1. Verificação da Esbeltez do perfil",null,null,null,null,null,null,null,null,null,null,"W 360 x 32,9",32.9,0.53077332358217166]
{"$rows_left_out":69}
{"sheet":"Ligação Soldada Viga-Pilar","index":1,"n_rows":30,"n_cols":15,"rows_kept":30,"cut":false,"hidden":false,"merged":[[31,0,31,1],[12,8,12,10],[25,9,25,10],[7,12,7,14],[2,12,2,14],[5,0,5,2],[5,4,5,6],[5,8,5,10]]}
[]
["Peça","Selecione o Perfil","d","bf","tw","tf","h","d’","Área","Ix","Wx",null,"Verificação dos enrijecedores à tração"]
["P1","W 150 x 22,5 (H)",{"$f":"IF($B3=\"\",\"\",VLOOKUP($B3,'Tabela de Perfis'!$A:$AC,3,0))","v":152},{"$f":"IF($B3=\"\",\"\",VLOOKUP($B3,'Tabela de Perfis'!$A:$AC,4,0))","v":152},{"$f":"IF($B3=\"\",\"\",VLOOKUP($B3,'Tabela de Perfis'!$A:$AC,5,0))","v":5.8},{"$f":"IF($B3=\"\",\"\",VLOOKUP($B3,'Tabela de Perfis'!$A:$AC,6,0))","v":6.6},{"$f":"IF($B3=\"\",\"\",VLOOKUP($B3,'Tabela de Perfis'!$A:$AC,7,0))","v":139},{"$f":"IF($B3=\"\",\"\",VLOOKUP($B3,'Tabela de Perfis'!$A:$AC,8,0))","v":119},{"$f":"IF($B3=\"\",\"\",VLOOKUP($B3,'Tabela de Perfis'!$A:$AC,9,0))","v":29},{"$f":"IF($B3=\"\",\"\",VLOOKUP($B3,'Tabela de Perfis'!$A:$AC,11,0))","v":1229},{"$f":"IF($B3=\"\",\"\",VLOOKUP($B3,'Tabela de Perfis'!$A:$AC,12,0))","v":161.69999999999999},null,"1 Escoamento da Seção Bruta"]
["P2","W 200 x 15,0",{"$f":"IF($B4=\"\",\"\",VLOOKUP($B4,'Tabela de Perfis'!$A:$AC,3,0))","v":200},{"$f":"IF($B4=\"\",\"\",VLOOKUP($B4,'Tabela de Perfis'!$A:$AC,4,0))","v":100},{"$f":"IF($B4=\"\",\"\",VLOOKUP($B4,'Tabela de Perfis'!$A:$AC,5,0))","v":4.3},{"$f":"IF($B4=\"\",\"\",VLOOKUP($B4,'Tabela de Perfis'!$A:$AC,6,0))","v":5.2},{"$f":"IF($B4=\"\",\"\",VLOOKUP($B4,'Tabela de Perfis'!$A:$AC,7,0))","v":190},{"$f":"IF($B4=\"\",\"\",VLOOKUP($B4,'Tabela de Perfis'!$A:$AC,8,0))","v":170},{"$f":"IF($B4=\"\",\"\",VLOOKUP($B4,'Tabela de Perfis'!$A:$AC,9,0))","v":19.399999999999999},{"$f":"IF($B4=\"\",\"\",VLOOKUP($B4,'Tabela de Perfis'!$A:$AC,11,0))","v":1305},{"$f":"IF($B4=\"\",\"\",VLOOKUP($B4,'Tabela de Perfis'!$A:$AC,12,0))","v":130.5},null,"Nt,Rd",{"$f":"(((D4-E4)/10)*(J7/10)*J8)/1.1","v":138.11250000000001},"kN"]
[null,null,null,null,null,null,null,null,null,null,null,null,"Nt,Sd",{"$f":"MAX(F12:F13)","v":109.0061224489796},"kN"]
["Material P1",null,null,null,"Material P2",null,null,null,"Enrijecedores",null,null,null,"Status",{"$f":"IF(N5>N4,\"REPROVADO\",\"APROVADO\")","v":"APROVADO"},{"$f":"N5/N4","v":0.78925602280010565}]
["Limite","Valor","Unidade",null,"Limite","Valor","Unidade",null,"Espessura (t)",6.35,"mm"]
["Fy",34.5,"kN/cm²",null,"Fy",34.5,"kN/cm²",null,"Fy",25,"kN/cm²",null,"2 Ruptura da Seção Líquida"]
["Fu",45,"kN/cm²",null,"Fu",45,"kN/cm²",null,"Fu",40,"kN/cm²",null,"Nt,Rd",{"$f":"(((D4-E4-2*F4)/10)*(J7/10)*J9)/1.35","v":160.49037037037036},"kN"]
[null,null,null,null,null,null,null,null,null,null,null,null,"Nt,Sd",{"$f":"N5","v":109.0061224489796},"kN"]
["Esforço","Valor","Unidade",null,"Esforço","Valor","Unidade",null,"y",0,"mm",null,"Status",{"$f":"IF(N10>N9,\"REPROVADO\",\"APROVADO\")","v":"APROVADO"},{"$f":"N10/N9","v":0.67920662278628674}]
["Msd",2355,"kN.cm",null,"Mesa Sup.",{"$f":"(B12/K3)*(D3/10*F3/10)+B13","v":109.0061224489796},"kN"]
["Nsd",-37.1,"kN",null,"Mesa Inf",{"$f":"(-1)*(B12/K3)*(D3/10*F3/10)+B13","v":-183.20612244897958},"kN",null,"Dados do Metal de Solda",null,null,null,"Verificação dos enrijecedores à compressão"]
[null,null,null,null,null,null,null,null,"Fw",48.5,"kN/cm²",null,"Iy",{"$f":"2*((((25*E4/10)*(E4/20)^3)/12)+((25*E4/10)*(E4/10/2)*(E4/10/4)^2)+((J7/10)*(((D4-E4)/20)^3))/12+((D4-E4)/20)*(J7/10)*(E4/20+((D4-E4)/40))^2)","v":52.98368444208333},"cm^4"]
["Verificação","Descrição",null,null,null,null,null,null,"Perna do Filete",5,"mm",null,"Ag",{"$f":"(D4/10*J7/10)+(25*E4/10*E4/10-E4/10*J7/10)","v":10.699450000000001},"cm²"]
{"$rows_left_out":16}
{"sheet":"Ligação Chapa de Cabeça","index":2,"n_rows":46,"n_cols":15,"rows_kept":46,"cut":false,"hidden":false,"merged":[[8,12,8,13],[32,0,32,2],[45,1,45,2],[37,0,37,2],[1,5,1,6],[2,5,2,6],[3,5,3,6],[4,5,4,6],[5,5,5,6],[7,4,7,5]]}
[null,null,null,null,null,null,null,null,null,null,null,null,"a'",{"$f":"K6+0.5*K8","v":46}]
["NSd (Esforço Axial)",0,"kN",null,null,"y (cm)",null,5.9594288969064877,null,"Fy da Chapa",25,"kN/cm²","e1/2",{"$f":"K4/2","v":38.5}]
["Msd (Momento Fletor)",7500,"kN.cm",null,null,"Momento Estático Superior",null,{"$f":"SUM(G11:G26)","v":269.91242422885887},null,"Espessura da Chapa",16,"mm","b+0,5db",{"$f":"K7+0.5*K8","v":36}]
["VSd (Esforço Cortante)",125,"kN",null,null,"Momento Estático Inferior",null,{"$f":"((B5/10)*H2^2)/2","v":269.91242510735901},null,"e1",77,"mm","p",{"$f":"MIN(N2:N3)+MIN(N3,K5)","v":72}]
["B (Largura da Chapa)",152,"mm",null,null,"Delta",null,{"$f":"H4-H3","v":8.7850014551804634E-7},null,"e2",37,"mm","d'(mm)",{"$f":"K8+1.6","v":13.6}]
["A( Altura da chapa)",445,"mm",null,null,"Ix (cm4)",null,{"$f":"((B5/10)*H2^3)/3+SUM(H11:H26)","v":9077.1131402635056},null,"a",40,"mm","delta",{"$f":"(N4-N5)/N4","v":0.81111111111111112}]
["Qtd de parafusos por linha",2,"Unid",null,null,null,null,null,null,"b",30,"mm","Ma(kN.cm)",{"$f":"((1.5*(N4/10)*((K3/10)^2)*K2)/6)/1.1","v":104.72727272727275}]
[null,null,null,null,null,null,null,null,null,"db",12,"mm","alfa",{"$f":"((MAX(I11:I26)*((K7-0.5*K8)/10))-N7)/(N6*N7)","v":0.38835082759799217}]
[null,null,null,null,null,null,null,null,null,null,null,null,{"$f":"IF(N8<=1,\"APROVADO\",\"REPROVADO\")","v":"APROVADO"}]
["Linha","dy(mm)","Diam. (mm)","Fu(kN/cm²)","Cisalh. No plano de Rosca?","Área (cm²)","Mom. Estático","Ai(dy-y)²","Tração por parafuso (kN)","Admissível(kN)","Tração Adicional devido ao Efeito Alavanca","Cisalhamento Por parafuso","Adm.","Esforços Combinados:","Status"]
["d1",40,16,82.5,"SIM",{"$f":"IF(C11=\"\",\"\",((((C11/10)^2)*PI())/4)*$B$7)","v":4.0212385965949355},{"$f":"IF(B11=\"\",\"\",IF(B11<$B$6/6,0,((B11/10)-$H$2)*F11))","v":0},{"$f":"IF(B11=\"\",\"\",IF(B11<$B$6/6,0,(((B11/10)-$H$2)^2)*F11))","v":0},{"$f":"IF(B11=\"\",\"\",IF(H11=0,0,($B$3/$H$6)*((B11/10)-$H$2))*(F11/$B$7)+($B$2/(COUNTIF($B$11:$B$26,\">0\")*$B$7)))","v":0},{"$f":"IF(B11=\"\",\"\",(0.75*(F11/$B$7)*D11)/1.35)","v":92.153384505300593},{"$f":"IF(B11=\"\",\"\",IF($N$8>=0,IF((I11*(($K$7-0.5*$K$8)/10)-$N$7)/($K$6+0.5*$K$8)<0,0,(I11*(($K$7-0.5*$K$8)/10)-$N$7)/(($K$6+0.5*$K$8)/10)),0))","v":0},{"$f":"IF(B11=\"\",\"\",$B$4/($B$7*(COUNTIF($B$11:$B$26,\">0\"))))","v":15.625},{"$f":"IF(B11=\"\",\"\",IF(E11=\"SIM\",(0.4*(F11/$B$7)*D11)/1.35,(0.5*(F11/$B$7)*D11)/1.35))","v":49.148471736160324},{"$f":"IF(B11=\"\",\"\",((I11+K11)/J11)^2+(L11/M11)^2)","v":0.10106947642502409},{"$f":"IF(B11=\"\",\"\",IF(OR($H$5>0.001,$H$5<-0.001),\"CALCULAR Y\",IF(N11<1,\"APROVADO\",\"REPROVADO\")))","v":"APROVADO"}]
["d2",107,16,82.5,"SIM",4.0212385965949355,19.06296748966226,90.369352820703952,7.87542547741762,92.153384505300593,0,15.625,49.148471736160324,{"$f":"IF(B12=\"\",\"\",((I12+K12)/J12)^2+(L12/M12)^2)","v":0.1083728829014983},"APROVADO"]
["d3",338,16,82.5,"SIM",4.0212385965949355,111.95357907100527,3116.8515783721236,{"$f":"IF(B13=\"\",\"\",IF(H13=0,0,($B$3/$H$6)*((B13/10)-$H$2))*(F13/$B$7)+($B$2/(COUNTIF($B$11:$B$26,\">0\")*$B$7)))","v":46.251039843718672},92.153384505300593,1.3641788907939256,15.625,49.148471736160324,0.36804348795376596,"APROVADO"]
["d4",405,16,82.5,"SIM",4.0212385965949355,138.89587766819133,4797.5429385247417,57.381629291953189,92.153384505300593,7.1714429507423709,15.625,49.148471736160324,0.59176404658303083,"APROVADO"]
["d5",null,{"$f":"IF(B15=\"\",\"\",$K$8)","v":""},null,null,"","","","","","","","","",""]
{"$rows_left_out":32}
{"sheet":"Placa de Base 1","index":3,"n_rows":19,"n_cols":5,"rows_kept":19,"cut":false,"hidden":false,"merged":[[5,0,5,1],[1,0,1,1],[1,3,1,4]]}
[]
["Cargas Atuantes",null,null,"Dados do chumbador"]
["Compressão (kN)",{"$f":"1.4*6.59","v":9.2259999999999991},null,"Fy (kN/cm²)",25]
["Carga Horizontal (kN)",1.9950000000000001,null,"Diâmetro (mm)",16]
[null,null,null,"Nrd (kN)",{"$f":"2*(0.4*(((E4/10)^2)*PI()/4)*E3)/1.1","v":36.556714514499411}]
["Dados da Chapa de Base",null,null,"STATUS",{"$f":"IF(E5>=B4,\"APROVADO\",\"REPROVADO\")","v":"APROVADO"}]
["Fy (kN/cm²)",25]
["B (mm)",250,null,"fck  concreto (kN/cm²)",2]
["C (mm)",350]
["P1","W 250 x 28,4",null,"fc (kN/cm²)",{"$f":"B3/(B8/10*B9/10)","v":1.0544E-2}]
["m (mm)",{"$f":"(B9-VLOOKUP(B10,'Tabela de Perfis'!A:C,3,0)*0.95)/2","v":51.5},null,"fc máx (kN/cm²)",{"$f":"E8/1.4","v":1.4285714285714286}]
["n(mm)",{"$f":"(B8-VLOOKUP(B10,'Tabela de Perfis'!A:D,4,0)*0.8)/2","v":84.199999999999989},null,"Espessura mínima (mm)",{"$f":"1.83*(B14/10)*SQRT(E10/B7)*10","v":3.164432786174634}]
["n' (mm)",{"$f":"(SQRT(VLOOKUP(B10,'Tabela de Perfis'!A:J,3,0)*(VLOOKUP(B10,'Tabela de Perfis'!A:H,4,0))))/4","v":40.712405971644564}]
["L (mm)",{"$f":"MAX(B11:B13)","v":84.199999999999989}]
["Espessura (t)",16]
{"$rows_left_out":5}
{"sheet":"Placa de Base 2","index":4,"n_rows":33,"n_cols":19,"rows_kept":33,"cut":false,"hidden":false,"merged":[[1,0,1,1],[1,3,1,4],[5,0,5,1],[14,0,14,1],[18,0,18,1],[14,3,14,4]]}
[]
["Cargas Atuantes",null,null,"Dados do chumbador"]
["Compressão (kN)",400,null,"Fy (kN/cm²)",25]
["Carga Horizontal (kN)",40,null,"Diâmetro (mm)",19]
[null,null,null,"Nrd (kN)",{"$f":"2*(0.4*(((E4/10)^2)*PI()/4)*E3)/1.1","v":51.55067945208706}]
["Dados da Chapa de Base",null,null,"STATUS",{"$f":"IF(E5>=B4,\"APROVADO\",\"REPROVADO\")","v":"APROVADO"}]
["Fy (kN/cm²)",25]
["B (mm)",225,null,"fck  concreto (kN/cm²)",2]
["C (mm)",250]
["P1","W 150 x 22,5 (H)",null,"fc (kN/cm²)",{"$f":"B3/(B8/10*B9/10)","v":0.71111111111111114}]
["Espessura do Enrij. (mm)",8,null,"fc máx (kN/cm²)",{"$f":"E8/1.4","v":1.4285714285714286}]
["Espessura da chapa (mm)",16]
["STATUS",{"$f":"IF(B12>=MAX(B17,B24,E20),\"APROVADO\",\"REPROVADO\")","v":"APROVADO"}]
[]
["Setor 1",null,null,"Setor 3"]
{"$rows_left_out":19}
{"sheet":"Placa de Base 3","index":5,"n_rows":33,"n_cols":19,"rows_kept":33,"cut":false,"hidden":false,"merged":[[21,0,21,1],[21,3,21,4],[1,0,1,1],[1,3,1,4],[5,0,5,1],[14,3,14,4],[14,0,14,1]]}
[]
["Cargas Atuantes",null,null,"Dados do chumbador"]
["Compressão (kN)",400,null,"Fy (kN/cm²)",25]
["Carga Horizontal (kN)",40,null,"Diâmetro (mm)",19]
[null,null,null,"Nrd (kN)",{"$f":"4*(0.4*(((E4/10)^2)*PI()/4)*E3)/1.1","v":103.10135890417412}]
["Dados da Chapa de Base",null,null,"STATUS",{"$f":"IF(E5>=B4,\"APROVADO\",\"REPROVADO\")","v":"APROVADO"}]
["Fy (kN/cm²)",25]
["B (mm)",225,null,"fck  concreto (kN/cm²)",2]
["C (mm)",250]
["P1","W 150 x 22,5 (H)",null,"fc (kN/cm²)",{"$f":"B3/(B8/10*B9/10)","v":0.71111111111111114}]
["Espessura dos Enrij. (mm)",8,null,"fc máx (kN/cm²)",{"$f":"E8/1.4","v":1.4285714285714286}]
["Espessura da chapa (mm)",10]
["STATUS",{"$f":"IF(B12>=MAX(F28,B20,E20),\"APROVADO\",\"REPROVADO\")","v":"APROVADO"}]
[]
["Setor 1",null,null,"Setor 3"]
{"$rows_left_out":19}
{"sheet":"Placa de Base 4","index":6,"n_rows":25,"n_cols":5,"rows_kept":25,"cut":false,"hidden":false,"merged":[[1,0,1,1],[1,3,1,4],[7,0,7,1],[14,0,14,1]]}
[]
["Cargas Atuantes",null,null,"Dados do chumbador"]
["Compressão (kN)",32.700000000000003,null,"Fy (kN/cm²)",25]
["Carga Horizontal (kN)",11.7,null,"Diâmetro (mm)",16]
["Mx (kN.cm)",1028,null,"a1 (mm)",50]
[null,null,null,"Qtd (n)",2]
[null,null,null,"e (mm)",100]
["Dados da Chapa de Base",null,null,"NtSd",{"$f":"B22","v":25.310973701311621}]
["Fy (kN/cm²)",25,null,"NtRd",{"$f":"E6*2*(0.75*E3*((E4/10)^2)*PI()/4)/1.1","v":137.0876794293728}]
["B (mm)",200,null,"VSd",{"$f":"B4/(E6*2)","v":2.9249999999999998}]
["C (mm)",250,null,"VRd",{"$f":"E9*0.53","v":72.656470097567592}]
["P1","W 150 x 22,5 (H)",null,"Esforços Combinados",{"$f":"SQRT((E8/E9)^2+(E10/E11)^2)","v":0.18897147806226811}]
["Espessura da chapa (mm)",16,null,"STATUS",{"$f":"IF(E12<=1,\"APROVADO\",\"REPROVADO\")","v":"APROVADO"}]
["STATUS",{"$f":"IF(B13>=B24,\"APROVADO\",\"REPROVADO\")","v":"APROVADO"}]
["Eixo X-X"]
{"$rows_left_out":11}
{"sheet":"Calcular Lista","index":7,"n_rows":90,"n_cols":28,"rows_kept":90,"cut":false,"hidden":false,"merged":[]}
[null,null,null,null,null,null,null,null,null,null,null,null,null,null,null,null,null,null,null,null,null,null,null,null,null,null,null,{"$f":"SUBTOTAL(9,AB3:AB5936)","v":364}]
[null,null,"Barra","Perfil","LBx (mm)","LBy (mm)","N(kN)","Vx(kN)","Vy(kN)","Mx(kN.cm)","My(kN.cm)","kx","ky","d (mm)","Resultado","λx","λy","ηN (Tração)","ηN (Comp.)","ηMx","ηMy","ηVx","ηVy","η N.Mx.My","%","Lb(mm)","L total(mm)","Peso"]
[null,null,1,"W 200 x 15,0",6000,1200,-100,0,40,3200,0,1,1,0,"APROVADO",0.36585365853658536,0.28301886792452829,0,0.24079684392146233,0.73662889375478668,0,0,0.24716324008538371,0.97742573767624896,0.97742573767624896,1200,6000,{"$f":"IF(C3=\"\",\"\",VLOOKUP(D3,'Tabela de Perfis'!A:B,2,0)*'Calcular Lista'!AA3/1000)","v":90}]
[null,null,2,"W 150 x 13,0",6000,1200,-25,0,55,1600,0,1,1,0,"APROVADO",0.4854368932038835,0.27027027027027023,0,9.3994864896118469E-2,0.55460809280123968,0,0,0.4592560204289225,0.60160552524929889,0.60160552524929889,1200,6000,{"$f":"IF(C4=\"\",\"\",VLOOKUP(D4,'Tabela de Perfis'!A:B,2,0)*'Calcular Lista'!AA4/1000)","v":78}]
[null,null,3,"W 310 x 21,0",5000,1200,-23,0,12,7500,0,1,1,0,"APROVADO",0.21240441801189466,0.31578947368421056,0,3.5860223105529873E-2,0.90917321416989638,0,0,4.1265848665002915E-2,0.9271033257226613,0.9271033257226613,1200,5000,{"$f":"IF(C5=\"\",\"\",VLOOKUP(D5,'Tabela de Perfis'!A:B,2,0)*'Calcular Lista'!AA5/1000)","v":105}]
[null,null,4,"W 150 x 13,0",7000,1200,40,0,69,1200,0,0.5,0.5,0,"APROVADO",0.18878101402373246,9.0090090090090086E-2,7.6829055351842146E-2,0,0.41595606960092979,0,0,0.57615755290173909,0.45437059727685086,0.57615755290173909,1200,7000,{"$f":"IF(C6=\"\",\"\",VLOOKUP(D6,'Tabela de Perfis'!A:B,2,0)*'Calcular Lista'!AA6/1000)","v":91}]
[null,null,null,null,null,null,null,null,null,null,null,null,null,null,null,null,null,null,null,null,null,null,null,null,null,null,null,{"$f":"IF(C7=\"\",\"\",VLOOKUP(D7,'Tabela de Perfis'!A:B,2,0)*'Calcular Lista'!AA7/1000)","v":""}]
[null,null,null,null,null,null,null,null,null,null,null,null,null,null,null,null,null,null,null,null,null,null,null,null,null,null,null,{"$f":"IF(C8=\"\",\"\",VLOOKUP(D8,'Tabela de Perfis'!A:B,2,0)*'Calcular Lista'!AA8/1000)","v":""}]
[null,null,null,null,null,null,null,null,null,null,null,null,null,null,null,null,null,null,null,null,null,null,null,null,null,null,null,{"$f":"IF(C9=\"\",\"\",VLOOKUP(D9,'Tabela de Perfis'!A:B,2,0)*'Calcular Lista'!AA9/1000)","v":""}]
[null,null,null,null,null,null,null,null,null,null,null,null,null,null,null,null,null,null,null,null,null,null,null,null,null,null,null,{"$f":"IF(C10=\"\",\"\",VLOOKUP(D10,'Tabela de Perfis'!A:B,2,0)*'Calcular Lista'!AA10/1000)","v":""}]
[null,null,null,null,null,null,null,null,null,null,null,null,null,null,null,null,null,null,null,null,null,null,null,null,null,null,null,{"$f":"IF(C11=\"\",\"\",VLOOKUP(D11,'Tabela de Perfis'!A:B,2,0)*'Calcular Lista'!AA11/1000)","v":""}]
[null,null,null,null,null,null,null,null,null,null,null,null,null,null,null,null,null,null,null,null,null,null,null,null,null,null,null,{"$f":"IF(C12=\"\",\"\",VLOOKUP(D12,'Tabela de Perfis'!A:B,2,0)*'Calcular Lista'!AA12/1000)","v":""}]
[null,null,null,null,null,null,null,null,null,null,null,null,null,null,null,null,null,null,null,null,null,null,null,null,null,null,null,{"$f":"IF(C13=\"\",\"\",VLOOKUP(D13,'Tabela de Perfis'!A:B,2,0)*'Calcular Lista'!AA13/1000)","v":""}]
[null,null,null,null,null,null,null,null,null,null,null,null,null,null,null,null,null,null,null,null,null,null,null,null,null,null,null,{"$f":"IF(C14=\"\",\"\",VLOOKUP(D14,'Tabela de Perfis'!A:B,2,0)*'Calcular Lista'!AA14/1000)","v":""}]
[null,null,null,null,null,null,null,null,null,null,null,null,null,null,null,null,null,null,null,null,null,null,null,null,null,null,null,{"$f":"IF(C15=\"\",\"\",VLOOKUP(D15,'Tabela de Perfis'!A:B,2,0)*'Calcular Lista'!AA15/1000)","v":""}]
{"$rows_left_out":76}
{"sheet":"Tabela de Perfis","index":8,"n_rows":91,"n_cols":29,"rows_kept":91,"cut":false,"hidden":false,"merged":[[0,20,0,22],[0,23,1,23],[0,24,1,24],[0,25,1,25],[0,28,1,28],[0,19,1,19],[0,0,1,0],[0,1,1,1],[0,2,1,2],[0,3,1,3],[0,4,0,5],[0,6,1,6],[0,7,1,7],[0,8,1,8],[0,10,0,13],[0,14,0,17],[0,18,1,18]]}
["BITOLA","MASSA LINEAR","d","bf","ESPESSURA",null,"h","d’","ÁREA","PERIMETRO","EIXO X-X",null,null,null,"EIXO Y-Y",null,null,null,"rt","It","ESBELTEZ",null,null,"Cw","u","ÁREA REDUZIDA","*CARGA ADM EST","*CARGA ADM EST","BITOLA"]
[null,null,null,null,"tw","tf",null,null,null,"u","Ix","Wx","rx","Zx","Iy","Wy","ry","Zy",null,null,"ABA - λf ","ABA - λw ","Coef Red. Q",null,null,null,"(Q.A's.fy)/1,66","(Q.A's.fy)/2,00"]
["mm x kg/m","kg/m","mm","mm","mm","mm","mm","mm","cm²","cm","cm⁴","cm³","cm","cm³","cm⁴","cm³","cm","cm³","cm","cm⁴","bf/2t","d’/t","≤ 1,00","cm⁶","m³/m","cm²","tf","tf","mm x kg/m"]
["W 150 x 13,0",13,148,100,4.3,4.9000000000000004,138,118,16.600000000000001,67,635,85.8,6.18,96.4,82,16.399999999999999,2.2200000000000002,25.5,2.6,1.72,10.199999999999999,27.49,1,4181,0.67,{"$f":"AA4/2.1","v":6.6666666666666661},14,11.2,"W 150 x 13,0"]
["W 150 x 18,0",18,153,102,5.8,7.1,139,119,23.4,69,939,122.8,6.34,139.4,126,24.7,2.3199999999999998,38.5,2.69,4.34,7.18,20.48,1,6683,0.69,{"$f":"AA5/2.1","v":13.333333333333332},28,22.4,"W 150 x 18,0"]
["W 150 x 22,5 (H)",22.5,152,152,5.8,6.6,139,119,29,88,1229,161.69999999999999,6.51,179.6,387,50.9,3.65,77.900000000000006,4.0999999999999996,4.75,11.52,20.48,1,20417,0.88,15.714285714285714,33,26.4,"W 150 x 22,5 (H)"]
["W 150 x 24,0",24,160,102,6.6,10.3,139,115,31.5,69,1384,173,6.63,197.6,183,35.9,2.41,55.8,2.73,11.08,4.95,17.48,1,10206,0.69,20.952380952380953,44,35.200000000000003,"W 150 x 24,0"]
["W 150 x 29,8 (H)",29.8,157,153,6.6,9.3000000000000007,138,118,38.5,90,1739,221.5,6.72,247.5,556,72.599999999999994,3.8,110.8,4.18,10.95,8.23,17.940000000000001,1,30277,0.9,25.238095238095237,53,42.4,"W 150 x 29,8 (H)"]
["W 150 x 37,1 (H)",37.1,162,154,8.1,11.6,139,119,47.8,91,2244,277,6.85,313.5,707,91.8,3.84,140.4,4.22,20.58,6.64,14.67,1,39930,0.91,34.285714285714285,72,57.6,"W 150 x 37,1 (H)"]
["W 200 x 15,0",15,200,100,4.3,5.2,190,170,19.399999999999999,77,1305,130.5,8.1999999999999993,147.9,87,17.399999999999999,2.12,27.3,2.5499999999999998,2.0499999999999998,9.6199999999999992,39.44,0.95,8222,0.77,7.6190476190476186,16,12.8,"W 200 x 15,0"]
["W 200 x 19,3",19.3,203,102,5.8,6.5,190,170,25.1,79,1686,166.1,8.19,190.6,116,22.7,2.14,35.9,2.59,4.0199999999999996,7.85,29.31,1,11098,0.79,13.333333333333332,28,22.4,"W 200 x 19,3"]
["W 200 x 22,5",22.5,206,102,6.2,8,190,170,29,79,2029,197,8.3699999999999992,225.5,142,27.9,2.2200000000000002,43.9,2.63,6.18,6.38,27.42,1,13868,0.79,17.142857142857142,36,28.8,"W 200 x 22,5"]
["W 200 x 26,6",26.6,207,133,5.8,8.4,190,170,34.200000000000003,92,2611,252.3,8.73,282.3,330,49.6,3.1,76.3,3.54,7.65,7.92,29.34,1,32477,0.92,20.476190476190474,43,34.4,"W 200 x 26,6"]
["W 200 x 31,3",31.3,210,134,6.4,10.199999999999999,190,170,40.299999999999997,93,3168,301.7,8.86,338.6,410,61.2,3.19,94,3.6,12.59,6.57,26.5,1,40822,0.93,26.666666666666664,56,44.8,"W 200 x 31,3"]
["W 200 x 35,9 (H)",35.9,201,165,6.2,10.199999999999999,181,161,45.7,103,3437,342,8.67,379.2,764,92.6,4.09,141,4.5,14.51,8.09,25.9,1,69502,1.03,30.476190476190474,64,51.2,"W 200 x 35,9 (H)"]
{"$rows_left_out":77}
{"sheet":"Aços","index":9,"n_rows":4,"n_cols":2,"rows_kept":4,"cut":false,"hidden":false,"merged":[]}
["Aço","Fy"]
["ASTM A36",25]
["CF-26",25]
["ASTM A572GR50",34.5]