{"text_format":"1","workbook":"xlsx","n_sheets":10,"sheets":["Perfis I-H Laminados","Ligação Soldada Viga-Pilar","Ligação Chapa de Cabeça","Placa de Base 1","Placa de Base 2","Placa de Base 3","Placa de Base 4","Calcular Lista","Tabela de Perfis","Aços"],"not_rendered":{"charts":4,"images":11,"macros":1,"external_links":0,"defined_names":27,"comments":1,"pivot_tables":0},"unopened":[],"bounds":{"document_bytes":16777216,"sheet_cells":100000,"rows_first":2000,"rows_last":500,"rows_between":2000,"halvings":0,"cell_chars":16384,"cell_head_chars":4096},"cells_cut":0,"cells_raw":0,"read":"whole","date_system":"1900"}

{"sheet":"Perfis I-H Laminados","index":0,"n_rows":83,"n_cols":20,"rows_kept":83,"cut":false,"hidden":false,"merged":[[53,1,53,2],[53,3,53,4],[60,1,60,2],[60,3,60,4],[65,1,65,2],[65,3,65,4],[43,1,43,2],[43,3,43,4],[45,1,45,2],[45,3,45,4],[48,1,48,2],[48,3,48,4],[38,1,38,2],[38,3,38,4],[0,1,1,15],[5,8,5,11],[6,1,6,2],[6,6,6,11],[18,1,18,2],[19,1,19,2],[31,1,31,2],[31,3,31,4],[36,1,36,2],[36,3,36,4],[22,1,24,2]]}
[null,"Dimensionamento de Perfis I e H Laminados Padrão Açominas"]
[]
[]
[]
[]
[null,null,null,null,null,null,"Resultado:",null,{"$f":"MAX(J17,J18,J22,J26,J30,J34,J38,J42,J49)","v":0.68513217408347227}]
[null,"Esforços e Distâncias",null,null,null,null,"W 200 x 15,0",null,null,null,null,null,null,null,null,null,null,"Perfil","Peso","%"]
[null,"Lx (mm)",6000,null,null,null,"d(mm)",{"$f":"VLOOKUP(G7,'Tabela de Perfis'!A:C,3,0)","v":200},"Wx(cm³)",{"$f":"VLOOKUP(G7,'Tabela de Perfis'!A:R,12,0)","v":130.5},"rx(cm)",{"$f":"VLOOKUP(G7,'Tabela de Perfis'!A:N,13,0)","v":8.1999999999999993},null,null,null,null,null,"W 310 x 23,8",23.8,0.95017735035431372]
[null,"Ly (mm)",2000,null,null,null,"bf(mm)",{"$f":"VLOOKUP(G7,'Tabela de Perfis'!A:D,4,0)","v":100},"Wy(cm³)",{"$f":"VLOOKUP(G7,'Tabela de Perfis'!A:R,16,0)","v":17.399999999999999},"ry(cm)",{"$f":"VLOOKUP(G7,'Tabela de Perfis'!A:R,17,0)","v":2.12},null,null,null,null,null,"W 250 x 25,3",25.3,0.97950763196061608]
[null,"N(kN)",-11.7,null,null,null,"d'(mm)",{"$f":"VLOOKUP(G7,'Tabela de Perfis'!A:H,8,0)","v":170},"Zx(cm³)",{"$f":"VLOOKUP(G7,'Tabela de Perfis'!A:N,14,0)","v":147.9},"Área(cm²)",{"$f":"VLOOKUP(G7,'Tabela de Perfis'!A:I,9,0)","v":19.399999999999999},null,null,null,null,null,"W 310 x 28,3",28.3,0.74893971593661812]
[null,"Vx(kN)",0,null,null,null,"tw(mm)",{"$f":"VLOOKUP(G7,'Tabela de Perfis'!A:F,5,0)","v":4.3},"Zy(cm³)",{"$f":"VLOOKUP(G7,'Tabela de Perfis'!A:R,18,0)","v":27.3},"ho/tw",{"$f":"H10/H11","v":39.534883720930232},"Limite:",{"$f":"1.49*SQRT(20500/C21)","v":36.32065328532051},null,{"$f":"IF(L11<N11,\"Compacta\",\"Esbelta\")","v":"Esbelta"},null,"W 250 x 28,4",28.4,0.84355772202947832]
[null,"Vy(kN)",32.700000000000003,null,null,null,"tf(mm)",{"$f":"VLOOKUP(G7,'Tabela de Perfis'!A:F,6,0)","v":5.2},"Ix(cm4)",{"$f":"VLOOKUP(G7,'Tabela de Perfis'!A:R,11,0)","v":1305},"b/tf",{"$f":"(H9/2)/H12","v":9.615384615384615},"Limite:",{"$f":"0.56*SQRT(20500/C21)","v":13.650715328711065},{"$f":"1.03*SQRT(20500/C21)","v":25.10756569387928},{"$f":"IF(L12>O12,\"Esbelta\",IF(L12<N12,\"Compacta\",\"semicompacta\"))","v":"Compacta"},null,"W 200 x 31,3",31.3,0.83913780363618118]
[null,"Mx(kN.cm)",2355,null,null,null,"h(mm)",{"$f":"H8-2*H12","v":189.6},"Iy(cm4)",{"$f":"VLOOKUP(G7,'Tabela de Perfis'!A:R,15,0)","v":87},"Peso (kg/m)",{"$f":"VLOOKUP(G7,'Tabela de Perfis'!A:B,2,0)","v":15},null,null,null,null,null,"W 250 x 32,7",32.700000000000003,0.66301193879917264]
[null,"My(kN.cm)",0,null,null,null,null,null,null,null,null,null,null,null,null,null,null,"W 310 x 32,7",32.700000000000003,0.62878890773878149]
[null,"kx",1,null,null,null,"1. Verificação da Esbeltez do perfil",null,null,null,null,null,null,null,null,null,null,"W 360 x 32,9",32.9,0.53077332358217166]
[null,"ky",1,"kz",1,null,"Limite","Real","Status","%",{"$f":"MAX(J17:J18)","v":0.47169811320754718},null,null,null,null,null,null,"W 200 x 35,9 (H)",35.9,0.74931956248158627]
[null,"d (mm)",0,null,null,null,{"$f":"IF(C10>0,300,IF(C10<0,200,\"N.A\"))","v":200},{"$f":"(C8*C15/10)/L8","v":73.170731707317074},{"$f":"IF(H17<G17,\"OK\",\"NOK\")","v":"OK"},{"$f":"IF(G17=\"N.A\",0,H17/G17)","v":0.36585365853658536},"λx",null,null,null,null,null,null,"W 150 x 37,1 (H)",37.1,0.90664445352238932]
[null,"Lb (mm)",2000,null,null,null,{"$f":"IF(C10>0,300,IF(C10<0,200,\"N.A\"))","v":200},{"$f":"(C9*C16/10)/L9","v":94.339622641509436},{"$f":"IF(H18<G18,\"OK\",\"NOK\")","v":"OK"},{"$f":"IF(G18=\"N.A\",0,H18/G18)","v":0.47169811320754718},"λy",null,null,null,null,null,null,"W 250 x 38,5",38.5,0.54866467127298268]
[null,"Material",null,null,null,null,null,null,null,null,null,null,null,null,null,null,null,"W 310 x 38,7",38.700000000000003,0.46167006377926456]
[null,"ASTM A572GR50",null,null,null,null,"2. Resistência à tração",null,null,null,null,null,null,null,null,null,null,"W 410 x 38,8",38.799999999999997,0.39096786547693535]
[null,"Fy (kN/cm²)",{"$f":"VLOOKUP(B20,Aços!A:B,2,0)","v":34.5},null,null,null,"Nrd(kN)","Nsd(kN)","Status","%","Coef. S",null,null,null,null,null,null,"W 360 x 39,0",39,0.43128212011178679]
[null,null,null,null,null,null,{"$f":"IF(C10<0,\"N.A\",L10*C21/K22)","v":"N.A"},{"$f":"IF(C10<0,0,C10)","v":0},{"$f":"IF(C10<0,\"N.A\",IF(H22<G22,\"OK\",\"NOK\"))","v":"N.A"},{"$f":"IF(C10<0,0,H22/G22)","v":0},1.1000000000000001,{"$f":"MAX(J22,J26)","v":3.7057469187899851E-2},null,null,null,null,null,"W 200 x 41,7 (H)",41.7,0.63338868092086109]
[null,"Dados para Cálculo de NRd",null,null,null,null,null,null,null,null,null,null,null,null,null,null,null,"W 360 x 44,0",44,0.36225737475176928]
[null,null,null,null,null,null,"3. Resistência à Compressão",null,null,null,null,null,null,null,null,null,null,"W 310 x 44,5",44.5,0.39858627243261735]
[null,null,null,null,null,null,"Nrd(kN)","Nsd(kN)","Status","%","Coef. S",null,null,null,null,null,null,"W 250 x 44,8",44.8,0.46857662435299086]
[null,"Q",{"$f":"VLOOKUP(G7,'Tabela de Perfis'!A:W,23,0)","v":0.95},null,null,null,{"$f":"IF(C10>0,\"N.A\",C30*C26*L10*C21/K26)","v":315.72582414290525},{"$f":"IF(C10>0,0,-C10)","v":11.7},{"$f":"IF(C10>0,\"N.A\",IF(H26<G26,\"OK\",\"NOK\"))","v":"OK"},{"$f":"IF(C10>0,0,H26/G26)","v":3.7057469187899851E-2},1.1000000000000001,{"$f":"IF(G26=\"N.A\",\"Não há compressão solicitante\",\"\")","v":""},null,null,null,null,null,"W 200 x 46,1 (H)",46.1,0.57366912269316417]
[null,"Nex(kN)",{"$f":"(PI()^2*20500*J12)/((C15*C8/10)^2)","v":733.43497705595291},"r0(cm)",{"$f":"SQRT((L8^2)+(L9^2))","v":8.4696162841063813},null,null,null,null,null,null,null,null,null,null,null,null,"W 410 x 46,1",46.1,0.31887061559965585]
[null,"Ney(kN)",{"$f":"(PI()^2*20500*J13)/((C16*C9/10)^2)","v":440.06098623357173},"Nez(kN)",{"$f":"(((PI()^2)*20500*VLOOKUP(G7,'Tabela de Perfis'!A:X,24,0))/(('Perfis I-H Laminados'!E16*'Perfis I-H Laminados'!C18/10)^2)+7700*VLOOKUP(G7,'Tabela de Perfis'!A:T,20,0))/(E27^2)","v":799.80166120020965},null,"4. Resistência à Flexão eixo X-X",null,null,null,null,null,null,null,null,null,null,"W 360 x 51,0",51,0.33760972316002702]
[null,"λ0",{"$f":"SQRT(C26*L10*C21/MIN(C27:C28,E28))","v":1.2020313131744926},null,null,null,"Mrd(kN.cm)","Msd(kN.cm)","Status","%","Coef. S",null,null,null,null,null,null,"W 200 x 52,0 (H)",52,0.56179775280898869]
[null,"χ",{"$f":"IF(C29<=1.5,0.658^(C29^2),0.877/(C29^2))","v":0.54620838198148236},null,null,null,{"$f":"MIN(C50:C52,E64)","v":3532.8350567819348},{"$f":"IF(C13<=0,0,C13)","v":2355},{"$f":"IF(C13<=0,\"N.A\",IF(H30<G30,\"OK\",\"NOK\"))","v":"OK"},{"$f":"IF(C13<=0,0,H30/G30)","v":0.66660343948952239},1.1000000000000001,null,null,null,null,null,null,"W 310 x 52,0",52,0.37509377344336081]
[null,null,null,null,null,null,null,null,null,null,null,null,null,null,null,null,null,"W 460 x 52,0",52,0.27917364600781686]
[null,"Esbeltez Limite FLA X-X",null,"Esbeltez Limite FLA Y-Y",null,null,"5. Resistência à Flexão eixo Y-Y",null,null,null,null,"bef",{"$f":"1.92*H11*SQRT(20500/C21)*(1-(0.34/L11)*SQRT(20500/C21))/10","v":15.906118946725826},null,null,null,null,"HP 200 x 53,0 (H)",53,0.58479532163742687]
[null,"λalma",{"$f":"(H8-2*H12)/H11","v":44.093023255813954},"λalma",{"$f":"C33","v":44.093023255813954},null,"Mrd(kN.cm)","Msd(kN.cm)","Status","%","Coef. S","Iy",{"$f":"(((H12/10)*(H9/10)^3)/12)*2 +(M32*(H11/10)^3)/12","v":86.772053983258118},null,null,null,null,"W 410 x 53,0",53,0.30211480362537763]
[null,"λp",{"$f":"3.76*SQRT(20500/C21)","v":91.654802921345706},"λp",{"$f":"C34/3.76*1.12","v":27.301430657422131},null,{"$f":"MIN(E50:E52)","v":545.72727272727263},{"$f":"IF(C14<=0,0,C14)","v":0},{"$f":"IF(C14<=0,\"N.A\",IF(H34<G34,\"OK\",\"NOK\"))","v":"N.A"},{"$f":"IF(IF(C14<=0,0,H34/G34)<0,\"N.A\",IF(C14<=0,0,H34/G34))","v":0},1.1000000000000001,"Wef",{"$f":"M33/(H9/20)*0.75","v":13.015808097488719},null,null,null,null,"W 360 x 57,8",57.8,0.33512064343163539]
[null,"λr",{"$f":"C34/3.76*5.7","v":138.94478102438049},"λr",{"$f":"C35/5.7*1.4","v":34.12678832177766},null,null,null,null,null,null,null,null,null,null,null,null,"W 200 x 59,0 (H)",59,0.55617352614015569]
[null,"Mr",{"$f":"C21*J8","v":4502.25},"Mr",{"$f":"C21*M34","v":449.04537936336084},null,"6. Resistência ao esforço cortante eixo X",null,null,null,null,null,null,null,null,null,null,"W 410 x 60,0",60,0.29620853080568721]
[null,{"$f":"IF(C33>C35,\"Esbelta\",IF(C33<=C34,\"Compacta\",\"Semi-Compacta\"))","v":"Compacta"},null,{"$f":"IF(E33>E35,\"Esbelta\",IF(E33<=E34,\"Compacta\",\"Semi-Compacta\"))","v":"Esbelta"},null,null,"Vrd(kN)","Vsd(kN)","Status","%","Coef. S",null,null,null,null,null,null,"W 460 x 60,0",60,0.27247956403269752]
[null,null,null,null,null,null,{"$f":"C58","v":195.70909090909089},{"$f":"C11","v":0},{"$f":"IF(C11<=0,\"N.A\",IF(H38<G38,\"OK\",\"NOK\"))","v":"N.A"},{"$f":"IF(C11<=0,0,H38/G38)","v":0},1.1000000000000001,null,null,null,null,null,null,"HP 250 x 62,0 (H)",62,0.47755491881566381]
[null,"Esbeltez Limite FLM X-X",null,"Esbeltez Limite FLM Y-Y",null,null,null,null,null,null,null,null,null,null,null,null,null,"W 360 x 64,0",64,0.33783783783783783]
[null,"λmesa",{"$f":"L12","v":9.615384615384615},"λmesa",{"$f":"C40","v":9.615384615384615},null,"7. Resistência ao esforço cortante eixo Y",null,null,null,null,null,null,null,null,null,null,"W 530 x 66,0",66,0.24437927663734116]
[null,"λp",{"$f":"0.38*SQRT(20500/C21)","v":9.2629854016253645},"λp",{"$f":"C41","v":9.2629854016253645},null,"Vrd(kN)","Vsd(kN)","Status","%","Coef. S",null,null,null,null,null,null,"W 410 x 67,0",67,0.29568302779420458]
[null,"λr",{"$f":"0.83*SQRT(20500/(C21-0.3*C21))","v":24.182236007083329},"λr",{"$f":"C42","v":24.182236007083329},null,{"$f":"E58","v":161.83636363636361},{"$f":"C12","v":32.700000000000003},{"$f":"IF(C12<=0,\"N.A\",IF(H42<G42,\"OK\",\"NOK\"))","v":"OK"},{"$f":"IF(C12<=0,0,H42/G42)","v":0.20205594876980118},1.1000000000000001,null,null,null,null,null,null,"W 460 x 68,0",68,0.27085590465872156]
[null,"Mr",{"$f":"(C21-0.3*C21)*J8","v":3151.5749999999998},"Mr",{"$f":"(C21-0.3*C21)*J9","v":420.20999999999992},null,null,null,null,null,null,null,null,null,null,null,null,"W 200 x 71,0 (H)",71,0.54525627044711011]
[null,{"$f":"IF(C40>C42,\"Esbelta\",IF(C40<=C41,\"Compacta\",\"Semi-Compacta\"))","v":"Semi-Compacta"},null,{"$f":"IF(E40>E42,\"Esbelta\",IF(E40<=E41,\"Compacta\",\"Semi-Compacta\"))","v":"Semi-Compacta"},null,null,"8. Resistência ao esforços Combinados",null,null,null,null,null,null,null,null,null,null,"W 360 x 72,0",72,0.3364737550471063]
[null,null,null,null,null,null,null,null,null,null,null,null,null,null,null,null,null,"W 530 x 72,0",72,0.23934897079942555]
[null,"Momento Plástico =Z.fy   X-X",null,"Momento Plástico =Z.fy   Y-Y",null,null,"Nsd/Nrd",{"$f":"IF(G22=\"N.A\",H26/G26,H22/G22)","v":3.7057469187899851E-2},null,null,null,null,null,null,null,null,null,"W 250 x 73,0 (H)",73,0.45372050816696918]
[null,"Mpl(kN.cm)",{"$f":"J10*C21","v":5102.55},"Mpl(kN.cm)",{"$f":"J11*C21","v":941.85},null,null,null,null,null,null,null,null,null,null,null,null,"W 460 x 74,0",74,0.26638252530633993]
[null,null,null,null,null,null,"Combinação","Limite","Resultado","Cálculo",null,null,null,null,null,null,null,"W 530 x 74,0",74,0.24084778420038536]
[null,"MRd X-X",null,"MRd Y-Y",null,null,"N.Mx.My",1,{"$f":"IF(J49<=H49,\"OK\",\"NOK\")","v":"OK"},{"$f":"IF(H46<0.2,H46/2+H30/G30+H34/G34,H46+(8/9)*(H34/G34+H30/G30))","v":0.68513217408347227},null,null,null,null,null,null,null,"W 410 x 75,0",75,0.29446407538280328]
[null,"FLA",{"$f":"IF(B37=\"Compacta\",C47,(C47-(C47-C36)*((C33-C34)/(C35-C34)))/K30)","v":5102.55},"FLA",{"$f":"IF(D37=\"Esbelta\",(J9^2)/J9*C21/K34,IF(D37=\"Compacta\",E47,(E47-(E47-E36)*((E33-E34)/(E35-E34)))/K30))","v":545.72727272727263},null,null,null,null,null,null,null,null,null,null,null,null,"HP 310 x 79,0 (H)",79,0.39154267815191857]
[null,"FLM",{"$f":"IF(B44=\"Compacta\",C47,(C47-(C47-C43)*((C40-C41)/(C42-C41)))/K30)","v":4596.7882896463716},"FLM",{"$f":"IF(D44=\"Esbelta\",J9*C21/K34,IF(D44=\"Compacta\",E47,(E47-(E47-E43)*((E40-E41)/(E42-E41)))/K30))","v":845.02603220638935},null,null,null,null,null,null,null,null,null,null,null,null,"W 360 x 79,0",79,0.33377837116154874]
[null,"1,5*W*Fy",{"$f":"1.5*J8*C21/K30","v":6139.431818181818},"1,5*W*Fy",{"$f":"1.5*J9*C21/K34","v":818.59090909090901},null,null,null,null,null,null,null,null,null,null,null,null,"W 250 x 80,0 (H)",80,0.45045045045045046]
[null,null,null,null,null,null,null,null,null,null,null,null,null,null,null,null,null,"W 460 x 82,0",82,0.26539278131634819]
[null,"Esforço Cortante X",null,"Esforço Cortante Y",null,null,null,null,null,null,null,null,null,null,null,null,null,"W 530 x 82,0",82,0.23430178069353327]
[null,"λMesa",{"$f":"C40","v":9.615384615384615},"λAlma",{"$f":"E33","v":44.093023255813954},null,null,null,null,null,null,null,null,null,null,null,null,"HP 250 x 85,0 (H)",85,0.46992481203007513]
[null,"λp",{"$f":"1.1*SQRT(C59*20500/C21)","v":26.813905109968164},"λp",{"$f":"1.1*SQRT(E59*20500/C21)","v":59.957714568117794},null,null,null,null,null,null,null,null,null,null,null,null,"W 410 x 85,0",85,0.29291154071470415]
[null,"Aw",{"$f":"2*H9/10*H12/10","v":10.4},"Aw",{"$f":"(H8/10)*H11/10","v":8.6},null,null,null,null,null,null,null,null,null,null,null,null,"W 530 x 85,0",85,0.23573785950023574]
[null,"Vrdx (kN)",{"$f":"0.6*C57*C21/K38","v":195.70909090909089},"Vrdy",{"$f":"0.6*E57*C21/K38","v":161.83636363636361},null,null,null,null,null,null,null,null,null,null,null,null,"W 200 x 86,0 (H)",86,0.5399568034557235]
[null,"kv",{"$f":"C15","v":1},"kv",{"$f":"IF(OR(C17/H10>3,C17/H10>((260/L11)^2),C17=0),5,5+5/((C17/H10)^2))","v":5},null,null,null,null,null,null,null,null,null,null,null,null,"W 250 x 89,0 (H)",89,0.44722719141323791]
[null,null,null,null,null,null,null,null,null,null,null,null,null,null,null,null,null,"W 460 x 89,0",89,0.26343519494204426]
[null,"Esbeltez Limite FLT X-X",null,"Estado Limite FLT",null,null,null,null,null,null,null,null,null,null,null,null,null,"W 360 x 91,0 (H)",91,0.32916392363396973]
[null,"λ(lb)",{"$f":"(C18/10)/L9","v":94.339622641509436},"B1",{"$f":"((0.7*C21)*VLOOKUP('Perfis I-H Laminados'!G7,'Tabela de Perfis'!A:AC,12,0))/(20500*VLOOKUP('Perfis I-H Laminados'!G7,'Tabela de Perfis'!A:T,20,0))","v":7.4992861392028556E-2},null,null,null,null,null,null,null,null,null,null,null,null,"W 530 x 92,0",92,0.23094688221709009]
[null,"λp",{"$f":"1.76*SQRT(20500/C21)","v":42.902248175949062},"Mcr",{"$f":"((((PI())^2)*20500*'Perfis I-H Laminados'!J13)/(('Perfis I-H Laminados'!C18/10)^2))*SQRT((VLOOKUP('Perfis I-H Laminados'!G7,'Tabela de Perfis'!A:AC,24,0)/'Perfis I-H Laminados'!J13)*(1+(0.039*VLOOKUP(G7,'Tabela de Perfis'!A:AC,20,0)*(('Perfis I-H Laminados'!C18/10)^2)/(VLOOKUP('Perfis I-H Laminados'!G7,'Tabela de Perfis'!A:AC,24,0)))))","v":5041.807887898698},null,null,null,null,null,null,null,null,null,null,null,null,"HP 310 x 93,0 (H)",93,0.38910505836575882]
[null,"λr",{"$f":"SQRT((SQRT(((((E62^2)*27*VLOOKUP(G7,'Tabela de Perfis'!A:X,24,0))/'Perfis I-H Laminados'!J13)+1))+1))*((SQRT('Perfis I-H Laminados'!J13*VLOOKUP('Perfis I-H Laminados'!G7,'Tabela de Perfis'!A:AC,20,0)))*1.38)/('Perfis I-H Laminados'!L9*VLOOKUP('Perfis I-H Laminados'!G7,'Tabela de Perfis'!A:AC,20,0)*'Perfis I-H Laminados'!E62)","v":125.40014205717108},"Mrd",{"$f":"IF(B66=\"Esbelta\",E63/K30,IF(B66=\"Semi-Compacta\",(E65-((C62-C63)/(C64-C63))*(E65-C65))/1.1,IF(B66=\"compacta\",J10*C21/K30)))","v":3532.8350567819348},null,null,null,null,null,null,null,null,null,null,null,null,"W 310 x 97,0 (H)",97,0.37230081906180196]
[null,"Mr",{"$f":"0.7*C21*J8","v":3151.5749999999998},"Mpl",{"$f":"J10*C21","v":5102.55},null,null,null,null,null,null,null,null,null,null,null,null,"W 460 x 97,0",97,0.26274303730951126]
[null,{"$f":"IF(C62>C64,\"Esbelta\",IF(C62<=C63,\"Compacta\",\"Semi-Compacta\"))","v":"Semi-Compacta"},null,null,null,null,null,null,null,null,null,null,null,null,null,null,null,"W 250 x 101,0 (H)",101,0.44365572315882879]
[null,null,null,null,null,null,null,null,null,null,null,null,null,null,null,null,null,"W 360 x 101,0 (H)",101,0.32701111837802488]
[null,null,null,null,null,null,null,null,null,null,null,null,null,null,null,null,null,"W 530 x 101,0",101,0.22862368541380884]
[null,null,null,null,null,null,null,null,null,null,null,null,null,null,null,null,null,"W 610 x 101,0",101,0.20567667626491157]
[null,null,null,null,null,null,null,null,null,null,null,null,null,null,null,null,null,"W 460 x 106,0",106,0.26260504201680673]
[null,null,null,null,null,null,null,null,null,null,null,null,null,null,null,null,null,"W 310 x 107,0 (H)",107,0.37064492216456635]
[null,null,null,null,null,null,null,null,null,null,null,null,null,null,null,null,null,"W 530 x 109,0",109,0.22789425706472194]
[null,null,null,null,null,null,null,null,null,null,null,null,null,null,null,null,null,"HP 310 x 110,0 (H)",110,0.38550501156515032]
[null,null,null,null,null,null,null,null,null,null,null,null,null,null,null,null,null,"W 360 x 110,0 (H)",110,0.32552083333333337]
[null,null,null,null,null,null,null,null,null,null,null,null,null,null,null,null,null,"W 610 x 113,0",113,0.20292207792207789]
[null,null,null,null,null,null,null,null,null,null,null,null,null,null,null,null,null,"W 250 x 115,0 (H)",115,0.43936731107205623]
[null,null,null,null,null,null,null,null,null,null,null,null,null,null,null,null,null,"W 310 x 117,0 (H)",117,0.36873156342182889]
[null,null,null,null,null,null,null,null,null,null,null,null,null,null,null,null,null,"W 360 x 122,0 (H)",122,0.32573289902280128]
[null,null,null,null,null,null,null,null,null,null,null,null,null,null,null,null,null,"HP 310 x 125,0 (H)",125,0.38314176245210724]
[null,null,null,null,null,null,null,null,null,null,null,null,null,null,null,null,null,"W 610 x 125,0",125,0.20088388911209321]
[null,null,null,null,null,null,null,null,null,null,null,null,null,null,null,null,null,"W 610 x 140,0",140,0.19952114924181963]
[null,null,null,null,null,null,null,null,null,null,null,null,null,null,null,null,null,"W 610 x 155,0",155,0.19546520719311963]
[null,null,null,null,null,null,null,null,null,null,null,null,null,null,null,null,null,"W 610 x 174,0",174,0.1941747572815534]

{"sheet":"Ligação Soldada Viga-Pilar","index":1,"n_rows":30,"n_cols":15,"rows_kept":30,"cut":false,"hidden":false,"merged":[[31,0,31,1],[12,8,12,10],[25,9,25,10],[7,12,7,14],[2,12,2,14],[5,0,5,2],[5,4,5,6],[5,8,5,10]]}
[]
["Peça","Selecione o Perfil","d","bf","tw","tf","h","d’","Área","Ix","Wx",null,"Verificação dos enrijecedores à tração"]
["P1","W 150 x 22,5 (H)",{"$f":"IF($B3=\"\",\"\",VLOOKUP($B3,'Tabela de Perfis'!$A:$AC,3,0))","v":152},{"$f":"IF($B3=\"\",\"\",VLOOKUP($B3,'Tabela de Perfis'!$A:$AC,4,0))","v":152},{"$f":"IF($B3=\"\",\"\",VLOOKUP($B3,'Tabela de Perfis'!$A:$AC,5,0))","v":5.8},{"$f":"IF($B3=\"\",\"\",VLOOKUP($B3,'Tabela de Perfis'!$A:$AC,6,0))","v":6.6},{"$f":"IF($B3=\"\",\"\",VLOOKUP($B3,'Tabela de Perfis'!$A:$AC,7,0))","v":139},{"$f":"IF($B3=\"\",\"\",VLOOKUP($B3,'Tabela de Perfis'!$A:$AC,8,0))","v":119},{"$f":"IF($B3=\"\",\"\",VLOOKUP($B3,'Tabela de Perfis'!$A:$AC,9,0))","v":29},{"$f":"IF($B3=\"\",\"\",VLOOKUP($B3,'Tabela de Perfis'!$A:$AC,11,0))","v":1229},{"$f":"IF($B3=\"\",\"\",VLOOKUP($B3,'Tabela de Perfis'!$A:$AC,12,0))","v":161.69999999999999},null,"1 Escoamento da Seção Bruta"]
["P2","W 200 x 15,0",{"$f":"IF($B4=\"\",\"\",VLOOKUP($B4,'Tabela de Perfis'!$A:$AC,3,0))","v":200},{"$f":"IF($B4=\"\",\"\",VLOOKUP($B4,'Tabela de Perfis'!$A:$AC,4,0))","v":100},{"$f":"IF($B4=\"\",\"\",VLOOKUP($B4,'Tabela de Perfis'!$A:$AC,5,0))","v":4.3},{"$f":"IF($B4=\"\",\"\",VLOOKUP($B4,'Tabela de Perfis'!$A:$AC,6,0))","v":5.2},{"$f":"IF($B4=\"\",\"\",VLOOKUP($B4,'Tabela de Perfis'!$A:$AC,7,0))","v":190},{"$f":"IF($B4=\"\",\"\",VLOOKUP($B4,'Tabela de Perfis'!$A:$AC,8,0))","v":170},{"$f":"IF($B4=\"\",\"\",VLOOKUP($B4,'Tabela de Perfis'!$A:$AC,9,0))","v":19.399999999999999},{"$f":"IF($B4=\"\",\"\",VLOOKUP($B4,'Tabela de Perfis'!$A:$AC,11,0))","v":1305},{"$f":"IF($B4=\"\",\"\",VLOOKUP($B4,'Tabela de Perfis'!$A:$AC,12,0))","v":130.5},null,"Nt,Rd",{"$f":"(((D4-E4)/10)*(J7/10)*J8)/1.1","v":138.11250000000001},"kN"]
[null,null,null,null,null,null,null,null,null,null,null,null,"Nt,Sd",{"$f":"MAX(F12:F13)","v":109.0061224489796},"kN"]
["Material P1",null,null,null,"Material P2",null,null,null,"Enrijecedores",null,null,null,"Status",{"$f":"IF(N5>N4,\"REPROVADO\",\"APROVADO\")","v":"APROVADO"},{"$f":"N5/N4","v":0.78925602280010565}]
["Limite","Valor","Unidade",null,"Limite","Valor","Unidade",null,"Espessura (t)",6.35,"mm"]
["Fy",34.5,"kN/cm²",null,"Fy",34.5,"kN/cm²",null,"Fy",25,"kN/cm²",null,"2 Ruptura da Seção Líquida"]
["Fu",45,"kN/cm²",null,"Fu",45,"kN/cm²",null,"Fu",40,"kN/cm²",null,"Nt,Rd",{"$f":"(((D4-E4-2*F4)/10)*(J7/10)*J9)/1.35","v":160.49037037037036},"kN"]
[null,null,null,null,null,null,null,null,null,null,null,null,"Nt,Sd",{"$f":"N5","v":109.0061224489796},"kN"]
["Esforço","Valor","Unidade",null,"Esforço","Valor","Unidade",null,"y",0,"mm",null,"Status",{"$f":"IF(N10>N9,\"REPROVADO\",\"APROVADO\")","v":"APROVADO"},{"$f":"N10/N9","v":0.67920662278628674}]
["Msd",2355,"kN.cm",null,"Mesa Sup.",{"$f":"(B12/K3)*(D3/10*F3/10)+B13","v":109.0061224489796},"kN"]
["Nsd",-37.1,"kN",null,"Mesa Inf",{"$f":"(-1)*(B12/K3)*(D3/10*F3/10)+B13","v":-183.20612244897958},"kN",null,"Dados do Metal de Solda",null,null,null,"Verificação dos enrijecedores à compressão"]
[null,null,null,null,null,null,null,null,"Fw",48.5,"kN/cm²",null,"Iy",{"$f":"2*((((25*E4/10)*(E4/20)^3)/12)+((25*E4/10)*(E4/10/2)*(E4/10/4)^2)+((J7/10)*(((D4-E4)/20)^3))/12+((D4-E4)/20)*(J7/10)*(E4/20+((D4-E4)/40))^2)","v":52.98368444208333},"cm^4"]
["Verificação","Descrição",null,null,null,null,null,null,"Perna do Filete",5,"mm",null,"Ag",{"$f":"(D4/10*J7/10)+(25*E4/10*E4/10-E4/10*J7/10)","v":10.699450000000001},"cm²"]
[1,"Flexão Local de Mesa Tracionada",null,null,null,null,null,null,"Perna mínima",{"$f":"IF(AND(MIN(F3:F4)<=19,MIN(F3:F4)>12.5),6,IF(AND(MIN(F3:F4)<=12.5,MIN(F3:F4)>6.35),5,IF(MIN(F3:F4)<=6.35,3,8)))","v":3},"mm"]
["Nt, Rd",{"$f":"IF(OR(AND(F13>0,(J11+C3)>10*F4),AND(F12>0,J11>10*F4)),6.25*(F4/10)^2*F8/1.1,(6.25*(F4/10)^2*F8/1.1)/2)","v":26.502272727272729},"kN",null,null,null,null,null,null,null,null,null,"b/t",{"$f":"((D4-E4)/2)/J7","v":7.5354330708661426}]
["Nt, Sd",{"$f":"IF(F12>0,F12,F13)","v":109.0061224489796},"kN",{"$f":"IF(B18<B17,\"Essa verificação não exigiu enrigecedor\",\"É necessário enrijecedor\")","v":"É necessário enrijecedor"},null,null,null,null,"1-Ruptura da Solda na Seção Efetiva",null,null,null,"b/t (lim)",{"$f":"0.56*(SQRT(20500/J8))","v":16.035959590869517}]
[null,null,null,null,null,null,null,null,"Fw, Rd ",{"$f":"0.6*(0.707*J15/10*((2*D3-2*F3-E3)/10)*J14/1.35)","v":217.1668333333333},"kN",null,"Q",{"$f":"IF(N18>N17,1,IF(N17<1.839*N18,1.415-0.74*N17*SQRT(J8/20500),0.69*20500/(J8*N17^2)))","v":1}]
[2,"Escoamento da Alma",null,null,null,null,null,null,"Ft, Sd",{"$f":"B18","v":109.0061224489796},"kN"]
["Nt,Rd",{"$f":"IF(OR(AND(F12>0,J11>C4),AND(F13>0,(J11+C3)>C4)),(5*(2*F4/10)+(F3/10))*1.1*(F4/10)*F8/1.1,(2.5*(2*F3/10)+(F4/10))*1.1*(F4/10)*F8/1.1)","v":68.530799999999985},null,null,null,null,null,null,null,null,null,null,"Ney",{"$f":"((PI()^2)*20500*N14)/((0.75*H4/10)^2)","v":65944.016028838538},"kN"]
["Nt,Sd",{"$f":"B18","v":109.0061224489796},null,{"$f":"IF(B22<B21,\"Essa verificação não exigiu enrigecedor\",\"É necessário enrijecedor\")","v":"É necessário enrijecedor"},null,null,null,null,"2-Escoamento do Metal Base",null,null,null,"Lambda-Zero",{"$f":"SQRT(N19*N15*J8/N21)","v":6.3688795419589897E-2}]
[null,null,null,null,null,null,null,null,"Ft, Rd",{"$f":"(0.6*(J15/10*(2*D3-2*F3-E3)/10*MIN(B8,F8))/1.1)","v":268.15909090909088},"kN",null,"X",{"$f":"IF(N22<1.5,0.658^(N22^2),0.877/(N22^2))","v":0.99830369021517407}]
[3,"Enrugamento da Alma Comprimida",null,null,null,null,null,null,"Ft, Sd",{"$f":"J20","v":109.0061224489796},"kN",null,"Nc, Rd",{"$f":"N23*N19*N15*J8/1.1","v":242.7568276880169}]
["Nc,Rd",{"$f":"IF(OR(AND(F13<0,(J11+C3)>0.5*C4),AND(F12<0,J11>0.5*C4)),((0.66*(E4/10)^2)/1.1)*(1+3*(F3/C4)*((E4/F4)^1.5))*(SQRT((20500*F8*(F4/10))/(E4/10))),IF(B27<0.2,((0.33*(E4/10)^2)/1.1)*(1+3*(F3/C4)*((E4/F4)^1.5))*(SQRT((20500*F8*(F4/10))/(E4/10))),((0.33*(E4/10)^2)/1.1)*(1+3*((4*F3/C4)+0.2)*(SQRT((20500*F8*(F4/10))/(E4/10))))))","v":110.23667051036182},null,null,null,null,null,null,null,null,null,null,"Nc, Sd",{"$f":"ABS(MIN(F12:F13))","v":183.20612244897958}]
["Nc,Sd",{"$f":"ABS(MIN(F12:F13))","v":183.20612244897958},null,{"$f":"IF(B26<B25,\"Essa verificação não exigiu enrigecedor\",\"É necessário enrijecedor\")","v":"É necessário enrijecedor"},null,null,null,null,"Status",{"$f":"IF(AND(J24<J23,J20<J19,J16<=J15),\"APROVADO\",\"REPROVADO\")","v":"APROVADO"},null,null,"Status",{"$f":"IF(N25>N24,\"REPROVADO\",\"APROVADO\")","v":"APROVADO"},{"$f":"N25/N24","v":0.75468988532190773}]
["Ln/d",{"$f":"F3/C4","v":3.3000000000000002E-2},null,null,null,null,null,null,{"$f":"IF(J15<J16,\"PERNA DO FILETE ABAIXO DO MÍNIMO\",\"\")","v":""}]
[4,"Flambagem da Alma Comprimida"]
["Nc, Rd",{"$f":"IF(OR(AND(F13<0,(J11+C3)>0.5*C4),AND(F12<0,J11>0.5*C4)),(24*((E4/10)^3)*SQRT(20500*F8))/(1.1*(H4/10)),(12*((E4/10)^3)*SQRT(20500*F8))/(1.1*(H4/10)))","v":85.814658782828459}]
["Nc, Sd",{"$f":"B26","v":183.20612244897958},null,{"$f":"IF(B30<B29,\"Essa verificação não exigiu enrigecedor\",\"É necessário enrijecedor\")","v":"É necessário enrijecedor"}]

{"sheet":"Ligação Chapa de Cabeça","index":2,"n_rows":46,"n_cols":15,"rows_kept":46,"cut":false,"hidden":false,"merged":[[8,12,8,13],[32,0,32,2],[45,1,45,2],[37,0,37,2],[1,5,1,6],[2,5,2,6],[3,5,3,6],[4,5,4,6],[5,5,5,6],[7,4,7,5]]}
[null,null,null,null,null,null,null,null,null,null,null,null,"a'",{"$f":"K6+0.5*K8","v":46}]
["NSd (Esforço Axial)",0,"kN",null,null,"y (cm)",null,5.9594288969064877,null,"Fy da Chapa",25,"kN/cm²","e1/2",{"$f":"K4/2","v":38.5}]
["Msd (Momento Fletor)",7500,"kN.cm",null,null,"Momento Estático Superior",null,{"$f":"SUM(G11:G26)","v":269.91242422885887},null,"Espessura da Chapa",16,"mm","b+0,5db",{"$f":"K7+0.5*K8","v":36}]
["VSd (Esforço Cortante)",125,"kN",null,null,"Momento Estático Inferior",null,{"$f":"((B5/10)*H2^2)/2","v":269.91242510735901},null,"e1",77,"mm","p",{"$f":"MIN(N2:N3)+MIN(N3,K5)","v":72}]
["B (Largura da Chapa)",152,"mm",null,null,"Delta",null,{"$f":"H4-H3","v":8.7850014551804634E-7},null,"e2",37,"mm","d'(mm)",{"$f":"K8+1.6","v":13.6}]
["A( Altura da chapa)",445,"mm",null,null,"Ix (cm4)",null,{"$f":"((B5/10)*H2^3)/3+SUM(H11:H26)","v":9077.1131402635056},null,"a",40,"mm","delta",{"$f":"(N4-N5)/N4","v":0.81111111111111112}]
["Qtd de parafusos por linha",2,"Unid",null,null,null,null,null,null,"b",30,"mm","Ma(kN.cm)",{"$f":"((1.5*(N4/10)*((K3/10)^2)*K2)/6)/1.1","v":104.72727272727275}]
[null,null,null,null,null,null,null,null,null,"db",12,"mm","alfa",{"$f":"((MAX(I11:I26)*((K7-0.5*K8)/10))-N7)/(N6*N7)","v":0.38835082759799217}]
[null,null,null,null,null,null,null,null,null,null,null,null,{"$f":"IF(N8<=1,\"APROVADO\",\"REPROVADO\")","v":"APROVADO"}]
["Linha","dy(mm)","Diam. (mm)","Fu(kN/cm²)","Cisalh. No plano de Rosca?","Área (cm²)","Mom. Estático","Ai(dy-y)²","Tração por parafuso (kN)","Admissível(kN)","Tração Adicional devido ao Efeito Alavanca","Cisalhamento Por parafuso","Adm.","Esforços Combinados:","Status"]
["d1",40,16,82.5,"SIM",{"$f":"IF(C11=\"\",\"\",((((C11/10)^2)*PI())/4)*$B$7)","v":4.0212385965949355},{"$f":"IF(B11=\"\",\"\",IF(B11<$B$6/6,0,((B11/10)-$H$2)*F11))","v":0},{"$f":"IF(B11=\"\",\"\",IF(B11<$B$6/6,0,(((B11/10)-$H$2)^2)*F11))","v":0},{"$f":"IF(B11=\"\",\"\",IF(H11=0,0,($B$3/$H$6)*((B11/10)-$H$2))*(F11/$B$7)+($B$2/(COUNTIF($B$11:$B$26,\">0\")*$B$7)))","v":0},{"$f":"IF(B11=\"\",\"\",(0.75*(F11/$B$7)*D11)/1.35)","v":92.153384505300593},{"$f":"IF(B11=\"\",\"\",IF($N$8>=0,IF((I11*(($K$7-0.5*$K$8)/10)-$N$7)/($K$6+0.5*$K$8)<0,0,(I11*(($K$7-0.5*$K$8)/10)-$N$7)/(($K$6+0.5*$K$8)/10)),0))","v":0},{"$f":"IF(B11=\"\",\"\",$B$4/($B$7*(COUNTIF($B$11:$B$26,\">0\"))))","v":15.625},{"$f":"IF(B11=\"\",\"\",IF(E11=\"SIM\",(0.4*(F11/$B$7)*D11)/1.35,(0.5*(F11/$B$7)*D11)/1.35))","v":49.148471736160324},{"$f":"IF(B11=\"\",\"\",((I11+K11)/J11)^2+(L11/M11)^2)","v":0.10106947642502409},{"$f":"IF(B11=\"\",\"\",IF(OR($H$5>0.001,$H$5<-0.001),\"CALCULAR Y\",IF(N11<1,\"APROVADO\",\"REPROVADO\")))","v":"APROVADO"}]
["d2",107,16,82.5,"SIM",4.0212385965949355,19.06296748966226,90.369352820703952,7.87542547741762,92.153384505300593,0,15.625,49.148471736160324,{"$f":"IF(B12=\"\",\"\",((I12+K12)/J12)^2+(L12/M12)^2)","v":0.1083728829014983},"APROVADO"]
["d3",338,16,82.5,"SIM",4.0212385965949355,111.95357907100527,3116.8515783721236,{"$f":"IF(B13=\"\",\"\",IF(H13=0,0,($B$3/$H$6)*((B13/10)-$H$2))*(F13/$B$7)+($B$2/(COUNTIF($B$11:$B$26,\">0\")*$B$7)))","v":46.251039843718672},92.153384505300593,1.3641788907939256,15.625,49.148471736160324,0.36804348795376596,"APROVADO"]
["d4",405,16,82.5,"SIM",4.0212385965949355,138.89587766819133,4797.5429385247417,57.381629291953189,92.153384505300593,7.1714429507423709,15.625,49.148471736160324,0.59176404658303083,"APROVADO"]
["d5",null,{"$f":"IF(B15=\"\",\"\",$K$8)","v":""},null,null,"","","","","","","","","",""]
["d6",null,"",null,null,"","","","","","","","","",""]
["d7",null,"",null,null,"","","","","","","","","",""]
["d8",null,"",null,null,"","","","","","","","","",""]
["d9",null,"",null,null,"","","","","","","","","",""]
["d10",null,"",null,null,"","","","","","","","","",""]
["d11",null,"",null,null,"","","","","","","","","",""]
["d12",null,"",null,null,"","","","","","","","","",""]
["d13",null,"",null,null,"","","","","","","","","",""]
["d14",null,"",null,null,"","","","","","","","","",""]
["d15",null,"",null,null,"","","","","","","","","",""]
["d16",null,"",null,null,"","","","","","","","","",""]
[null,null,null,null,null,null,null,null,null,null,null,{"$f":"IF(B27=\"\",\"\",IF(E27=\"SIM\",(0.4*(F27/$B$7)*D27)/1.35,(0.5*(F27/$B$7)*D27)/1.35))","v":""}]
[]
["Verificação da Solda Chapa-Viga"]
["Selecione o Perfil","d","bf","tw","tf","h","d’","Área","Ix","Wx"]
["W 150 x 18,0",{"$f":"IF($A31=\"\",\"\",VLOOKUP($A31,'Tabela de Perfis'!$A:$AC,3,0))","v":153},{"$f":"IF($A31=\"\",\"\",VLOOKUP($A31,'Tabela de Perfis'!$A:$AC,4,0))","v":102},{"$f":"IF($A31=\"\",\"\",VLOOKUP($A31,'Tabela de Perfis'!$A:$AC,5,0))","v":5.8},{"$f":"IF($A31=\"\",\"\",VLOOKUP($A31,'Tabela de Perfis'!$A:$AC,6,0))","v":7.1},{"$f":"IF($A31=\"\",\"\",VLOOKUP($A31,'Tabela de Perfis'!$A:$AC,7,0))","v":139},{"$f":"IF($A31=\"\",\"\",VLOOKUP($A31,'Tabela de Perfis'!$A:$AC,8,0))","v":119},{"$f":"IF($A31=\"\",\"\",VLOOKUP($A31,'Tabela de Perfis'!$A:$AC,9,0))","v":23.4},{"$f":"IF($A31=\"\",\"\",VLOOKUP($A31,'Tabela de Perfis'!$A:$AC,11,0))","v":939},{"$f":"IF($A31=\"\",\"\",VLOOKUP($A31,'Tabela de Perfis'!$A:$AC,12,0))","v":122.8}]
[null,null,null,null,{"$f":"K3","v":16}]
["Dados do Metal de Solda"]
["Fw",48.5,"kN/cm²"]
["Perna do Filete",6,"mm"]
["Perna mínima",{"$f":"IF(AND(MIN(E31:E32)<=19,MIN(E31:E32)>12.5),6,IF(AND(MIN(E31:E32)<=12.5,MIN(E31:E32)>6.35),5,IF(MIN(E31:E32)<=6.35,3,8)))","v":5},"mm"]
[]
["1-Ruptura da Solda na Seção Efetiva"]
["Fw, Rd ",{"$f":"0.6*(0.707*B35/10*((2*C31-2*E31-D31)/10)*B34/1.35)","v":168.24714666666668},"kN"]
["Ft, Sd",{"$f":"(B3/J31)*(C31/10*E31/10)","v":442.3045602605863},"kN"]
[]
["2-Escoamento do Metal Base"]
["Ft, Rd",{"$f":"(0.6*(B35/10*(2*C31-2*E31-D31)/10*K2/1.1))","v":150.54545454545453},"kN"]
["Ft, Sd",{"$f":"B40","v":442.3045602605863},"kN"]
[]
["Status",{"$f":"IF(AND(B44<B43,B40<B39,B36<=B35),\"APROVADO\",\"REPROVADO\")","v":"REPROVADO"}]

{"sheet":"Placa de Base 1","index":3,"n_rows":19,"n_cols":5,"rows_kept":19,"cut":false,"hidden":false,"merged":[[5,0,5,1],[1,0,1,1],[1,3,1,4]]}
[]
["Cargas Atuantes",null,null,"Dados do chumbador"]
["Compressão (kN)",{"$f":"1.4*6.59","v":9.2259999999999991},null,"Fy (kN/cm²)",25]
["Carga Horizontal (kN)",1.9950000000000001,null,"Diâmetro (mm)",16]
[null,null,null,"Nrd (kN)",{"$f":"2*(0.4*(((E4/10)^2)*PI()/4)*E3)/1.1","v":36.556714514499411}]
["Dados da Chapa de Base",null,null,"STATUS",{"$f":"IF(E5>=B4,\"APROVADO\",\"REPROVADO\")","v":"APROVADO"}]
["Fy (kN/cm²)",25]
["B (mm)",250,null,"fck  concreto (kN/cm²)",2]
["C (mm)",350]
["P1","W 250 x 28,4",null,"fc (kN/cm²)",{"$f":"B3/(B8/10*B9/10)","v":1.0544E-2}]
["m (mm)",{"$f":"(B9-VLOOKUP(B10,'Tabela de Perfis'!A:C,3,0)*0.95)/2","v":51.5},null,"fc máx (kN/cm²)",{"$f":"E8/1.4","v":1.4285714285714286}]
["n(mm)",{"$f":"(B8-VLOOKUP(B10,'Tabela de Perfis'!A:D,4,0)*0.8)/2","v":84.199999999999989},null,"Espessura mínima (mm)",{"$f":"1.83*(B14/10)*SQRT(E10/B7)*10","v":3.164432786174634}]
["n' (mm)",{"$f":"(SQRT(VLOOKUP(B10,'Tabela de Perfis'!A:J,3,0)*(VLOOKUP(B10,'Tabela de Perfis'!A:H,4,0))))/4","v":40.712405971644564}]
["L (mm)",{"$f":"MAX(B11:B13)","v":84.199999999999989}]
["Espessura (t)",16]
["STATUS",{"$f":"IF(AND(B15>=E12,E11>=E10),\"APROVADO\",\"REPROVADO\")","v":"APROVADO"}]
[]
[]
["Peso total (kg)",{"$f":"B8/1000*B9/1000*B15/1000*7850","v":10.99}]

{"sheet":"Placa de Base 2","index":4,"n_rows":33,"n_cols":19,"rows_kept":33,"cut":false,"hidden":false,"merged":[[1,0,1,1],[1,3,1,4],[5,0,5,1],[14,0,14,1],[18,0,18,1],[14,3,14,4]]}
[]
["Cargas Atuantes",null,null,"Dados do chumbador"]
["Compressão (kN)",400,null,"Fy (kN/cm²)",25]
["Carga Horizontal (kN)",40,null,"Diâmetro (mm)",19]
[null,null,null,"Nrd (kN)",{"$f":"2*(0.4*(((E4/10)^2)*PI()/4)*E3)/1.1","v":51.55067945208706}]
["Dados da Chapa de Base",null,null,"STATUS",{"$f":"IF(E5>=B4,\"APROVADO\",\"REPROVADO\")","v":"APROVADO"}]
["Fy (kN/cm²)",25]
["B (mm)",225,null,"fck  concreto (kN/cm²)",2]
["C (mm)",250]
["P1","W 150 x 22,5 (H)",null,"fc (kN/cm²)",{"$f":"B3/(B8/10*B9/10)","v":0.71111111111111114}]
["Espessura do Enrij. (mm)",8,null,"fc máx (kN/cm²)",{"$f":"E8/1.4","v":1.4285714285714286}]
["Espessura da chapa (mm)",16]
["STATUS",{"$f":"IF(B12>=MAX(B17,B24,E20),\"APROVADO\",\"REPROVADO\")","v":"APROVADO"}]
[]
["Setor 1",null,null,"Setor 3"]
["L (cm)",{"$f":"((B9-(VLOOKUP(B10,'Tabela de Perfis'!A:D,4,0)+2*B11))/2)/10","v":4.0999999999999996},null,"b",{"$f":"(VLOOKUP('Placa de Base 2'!B10,'Tabela de Perfis'!A:D,4,0)-VLOOKUP(B10,'Tabela de Perfis'!A:F,5,0))/2","v":73.099999999999994},null,null,null,null,null,null,"a/b",0.25,0.5,0.75,1,1.5,2,3]
["Espessura mínima (mm)",{"$f":"SQRT((6*((E10*B16^2)/2)*1.1)/E3)*10","v":12.561443653763156},null,"a ",{"$f":"VLOOKUP(B10,'Tabela de Perfis'!A:G,7,0)","v":139},null,null,null,null,null,null,"Beta-1",0.05,0.19,0.39,0.67,1.28,1.8,2.5]
[null,null,null,"a/b",{"$f":"E17/E16","v":1.9015047879616964}]
["Setor 2",null,null,"Beta-2",{"$f":"1.5804*(E18^2)-2.9839*E18+1.4657","v":1.506084476037735}]
["b",{"$f":"(B9-VLOOKUP(B10,'Tabela de Perfis'!A:C,3,0))/2","v":49},null,"Espessura mínima (mm)",{"$f":"SQRT(E19*E10*1.1/E3)*(E16/10)*10","v":15.868545209757993}]
["a",{"$f":"VLOOKUP(B10,'Tabela de Perfis'!A:D,4,0)","v":152}]
["a/b",{"$f":"B21/B20","v":3.1020408163265305},null,"Peso total",{"$f":"B9/1000*B8/1000*B12/1000*7850+B11/1000*0.1*B9/1000*7850*2-B20/1000*0.1*B11/1000*2*7850","v":9.5895600000000005}]
["Beta-1",{"$f":"IF(B22>=3,2.5,-0.1535*(B22^3)+0.6806*(B22^2)+0.1878*B22-0.0481)","v":2.5}]
["Espessura mínima (mm)",{"$f":"SQRT(B23*E10*1.1/E3)*(B20/10)*10","v":13.704435616089983}]
[]
[]
[]
[]
[]
[]
[]
[null,null,null,null,null,null,null,null,null,null,null,"a/b",1,1.2,1.4,1.6,1.8,2]
[null,null,null,null,null,null,null,null,null,null,null,"Beta-2",0.05,0.19,0.39,0.67,1.28,1.8]

{"sheet":"Placa de Base 3","index":5,"n_rows":33,"n_cols":19,"rows_kept":33,"cut":false,"hidden":false,"merged":[[21,0,21,1],[21,3,21,4],[1,0,1,1],[1,3,1,4],[5,0,5,1],[14,3,14,4],[14,0,14,1]]}
[]
["Cargas Atuantes",null,null,"Dados do chumbador"]
["Compressão (kN)",400,null,"Fy (kN/cm²)",25]
["Carga Horizontal (kN)",40,null,"Diâmetro (mm)",19]
[null,null,null,"Nrd (kN)",{"$f":"4*(0.4*(((E4/10)^2)*PI()/4)*E3)/1.1","v":103.10135890417412}]
["Dados da Chapa de Base",null,null,"STATUS",{"$f":"IF(E5>=B4,\"APROVADO\",\"REPROVADO\")","v":"APROVADO"}]
["Fy (kN/cm²)",25]
["B (mm)",225,null,"fck  concreto (kN/cm²)",2]
["C (mm)",250]
["P1","W 150 x 22,5 (H)",null,"fc (kN/cm²)",{"$f":"B3/(B8/10*B9/10)","v":0.71111111111111114}]
["Espessura dos Enrij. (mm)",8,null,"fc máx (kN/cm²)",{"$f":"E8/1.4","v":1.4285714285714286}]
["Espessura da chapa (mm)",10]
["STATUS",{"$f":"IF(B12>=MAX(F28,B20,E20),\"APROVADO\",\"REPROVADO\")","v":"APROVADO"}]
[]
["Setor 1",null,null,"Setor 3"]
["b",{"$f":"B8-(VLOOKUP(B10,'Tabela de Perfis'!A:D,4,0)+2*B11)","v":57},null,"b",{"$f":"(VLOOKUP('Placa de Base 3'!B10,'Tabela de Perfis'!A:D,4,0)-VLOOKUP(B10,'Tabela de Perfis'!A:F,5,0))/2","v":73.099999999999994},null,null,null,null,null,null,"a/b",0.25,0.5,0.75,1,1.5,2,3]
["a",{"$f":"VLOOKUP(B10,'Tabela de Perfis'!A:C,3,0)/2-B11","v":68},null,"a ",{"$f":"VLOOKUP(B10,'Tabela de Perfis'!A:G,7,0)/2-B11/2","v":65.5},null,null,null,null,null,null,"Beta-1",0.05,0.19,0.39,0.67,1.28,1.8,2.5]
["a/b",{"$f":"B17/B16","v":1.1929824561403508},null,"a/b",{"$f":"E17/E16","v":0.89603283173734616}]
["Beta-1",{"$f":"IF(B18>=3,2.5,-0.1535*(B18^3)+0.6806*(B18^2)+0.1878*B18-0.0481)","v":0.88395519863061756},null,"Beta-2",{"$f":"1.5804*(E18^2)-2.9839*E18+1.4657","v":6.0891023484123563E-2}]
["Espessura mínima (mm)",{"$f":"SQRT(B19*E10*1.1/E3)*(B16/10)*10","v":9.4794917585444356},null,"Espessura mínima (mm)",{"$f":"SQRT(E19*E10*1.1/E3)*(E16/10)*10","v":3.190722864305191}]
[]
["Setor 2",null,null,"Setor 4"]
["b",{"$f":"(B9-VLOOKUP(B10,'Tabela de Perfis'!A:C,3,0))/2","v":49},null,"b",{"$f":"(B8-(VLOOKUP(B10,'Tabela de Perfis'!A:D,4,0)+2*B11))/2","v":28.5}]
["a",{"$f":"VLOOKUP(B10,'Tabela de Perfis'!A:D,4,0)/2-B11/2","v":72},null,"a",{"$f":"B23","v":49}]
["a/b",{"$f":"B24/B23","v":1.4693877551020409},null,"a/b",{"$f":"E24/E23","v":1.7192982456140351}]
["Beta-1",{"$f":"IF(B25>=3,2.5,-0.1535*(B25^3)+0.6806*(B25^2)+0.1878*B25-0.0481)","v":1.2103474428171934},null,"Beta-1",{"$f":"IF(E25>=3,2.5,-0.1535*(E25^3)+0.6806*(E25^2)+0.1878*E25-0.0481)","v":1.506507465724946}]
["Espessura mínima (mm)",{"$f":"SQRT(B26*E10*1.1/E3)*(B23/10)*10","v":9.5355594696522346},null,"Espessura mínima (mm)",{"$f":"SQRT(E26*E10*1.1/E3)*(E23/10)*10","v":6.1876476416260227}]
[]
["Peso total",{"$f":"B8/1000*B9/1000*B12/1000*7850+0.1*B9/1000*B11/1000*7850*2-B23/1000*0.1*B11/1000*1*7850+B16/1000*0.1*B11/1000*3*7850+E16/1000*0.1*B11/1000*7850","v":8.7808530000000005}]
[]
[]
[null,null,null,null,null,null,null,null,null,null,null,"a/b",1,1.2,1.4,1.6,1.8,2]
[null,null,null,null,null,null,null,null,null,null,null,"Beta-2",0.05,0.19,0.39,0.67,1.28,1.8]

{"sheet":"Placa de Base 4","index":6,"n_rows":25,"n_cols":5,"rows_kept":25,"cut":false,"hidden":false,"merged":[[1,0,1,1],[1,3,1,4],[7,0,7,1],[14,0,14,1]]}
[]
["Cargas Atuantes",null,null,"Dados do chumbador"]
["Compressão (kN)",32.700000000000003,null,"Fy (kN/cm²)",25]
["Carga Horizontal (kN)",11.7,null,"Diâmetro (mm)",16]
["Mx (kN.cm)",1028,null,"a1 (mm)",50]
[null,null,null,"Qtd (n)",2]
[null,null,null,"e (mm)",100]
["Dados da Chapa de Base",null,null,"NtSd",{"$f":"B22","v":25.310973701311621}]
["Fy (kN/cm²)",25,null,"NtRd",{"$f":"E6*2*(0.75*E3*((E4/10)^2)*PI()/4)/1.1","v":137.0876794293728}]
["B (mm)",200,null,"VSd",{"$f":"B4/(E6*2)","v":2.9249999999999998}]
["C (mm)",250,null,"VRd",{"$f":"E9*0.53","v":72.656470097567592}]
["P1","W 150 x 22,5 (H)",null,"Esforços Combinados",{"$f":"SQRT((E8/E9)^2+(E10/E11)^2)","v":0.18897147806226811}]
["Espessura da chapa (mm)",16,null,"STATUS",{"$f":"IF(E12<=1,\"APROVADO\",\"REPROVADO\")","v":"APROVADO"}]
["STATUS",{"$f":"IF(B13>=B24,\"APROVADO\",\"REPROVADO\")","v":"APROVADO"}]
["Eixo X-X"]
["fc compressão máx (kN/cm²)",{"$f":"B3/(B10/10*B11/10)+(6*B5/(B10/10*(B11/10)^2))","v":0.55884},null,"fck  concreto (kN/cm²)",2]
["fc tração máx (kN/cm²)",{"$f":"ABS(B3/(B10/10*B11/10)-(6*B5/(B10/10*(B11/10)^2)))","v":0.42803999999999998},null,"fc (kN/cm²)",{"$f":"B16","v":0.55884}]
["c (cm)",{"$f":"(B11/10)/((B17/B16)+1)","v":14.156736381322958},null,"fc máx (kN/cm²)",{"$f":"E16/1.4","v":1.4285714285714286}]
["c/3 (cm)",{"$f":"B18/3","v":4.7189121271076528},null,"STATUS",{"$f":"IF(E17<=E18,\"APROVADO\",\"REPROVADO\")","v":"APROVADO"}]
["a (cm)",{"$f":"B11/20-B19","v":7.7810878728923472}]
["y (cm)",{"$f":"(B11-E5-B19*10)/10","v":15.281087872892346}]
["Tração / Chumbador (kN)",{"$f":"((B5-B3*B20)/B21)/E6","v":25.310973701311621}]
["Momento Fletor na aba (kN.cm)",{"$f":"((((B11-VLOOKUP(B12,'Tabela de Perfis'!A:C,3,0))/2)/10)^2)*E17/2","v":6.7088742000000012}]
["Espessura mínima da chapa(mm)",{"$f":"SQRT(6.6*B23/B9)*10","v":13.308428865948077}]
["Peso total",{"$f":"B10/1000*B11/1000*B13/1000*7850","v":6.28}]

{"sheet":"Calcular Lista","index":7,"n_rows":90,"n_cols":28,"rows_kept":90,"cut":false,"hidden":false,"merged":[]}
[null,null,null,null,null,null,null,null,null,null,null,null,null,null,null,null,null,null,null,null,null,null,null,null,null,null,null,{"$f":"SUBTOTAL(9,AB3:AB5936)","v":364}]
[null,null,"Barra","Perfil","LBx (mm)","LBy (mm)","N(kN)","Vx(kN)","Vy(kN)","Mx(kN.cm)","My(kN.cm)","kx","ky","d (mm)","Resultado","λx","λy","ηN (Tração)","ηN (Comp.)","ηMx","ηMy","ηVx","ηVy","η N.Mx.My","%","Lb(mm)","L total(mm)","Peso"]
[null,null,1,"W 200 x 15,0",6000,1200,-100,0,40,3200,0,1,1,0,"APROVADO",0.36585365853658536,0.28301886792452829,0,0.24079684392146233,0.73662889375478668,0,0,0.24716324008538371,0.97742573767624896,0.97742573767624896,1200,6000,{"$f":"IF(C3=\"\",\"\",VLOOKUP(D3,'Tabela de Perfis'!A:B,2,0)*'Calcular Lista'!AA3/1000)","v":90}]
[null,null,2,"W 150 x 13,0",6000,1200,-25,0,55,1600,0,1,1,0,"APROVADO",0.4854368932038835,0.27027027027027023,0,9.3994864896118469E-2,0.55460809280123968,0,0,0.4592560204289225,0.60160552524929889,0.60160552524929889,1200,6000,{"$f":"IF(C4=\"\",\"\",VLOOKUP(D4,'Tabela de Perfis'!A:B,2,0)*'Calcular Lista'!AA4/1000)","v":78}]
[null,null,3,"W 310 x 21,0",5000,1200,-23,0,12,7500,0,1,1,0,"APROVADO",0.21240441801189466,0.31578947368421056,0,3.5860223105529873E-2,0.90917321416989638,0,0,4.1265848665002915E-2,0.9271033257226613,0.9271033257226613,1200,5000,{"$f":"IF(C5=\"\",\"\",VLOOKUP(D5,'Tabela de Perfis'!A:B,2,0)*'Calcular Lista'!AA5/1000)","v":105}]
[null,null,4,"W 150 x 13,0",7000,1200,40,0,69,1200,0,0.5,0.5,0,"APROVADO",0.18878101402373246,9.0090090090090086E-2,7.6829055351842146E-2,0,0.41595606960092979,0,0,0.57615755290173909,0.45437059727685086,0.57615755290173909,1200,7000,{"$f":"IF(C6=\"\",\"\",VLOOKUP(D6,'Tabela de Perfis'!A:B,2,0)*'Calcular Lista'!AA6/1000)","v":91}]
[null,null,null,null,null,null,null,null,null,null,null,null,null,null,null,null,null,null,null,null,null,null,null,null,null,null,null,{"$f":"IF(C7=\"\",\"\",VLOOKUP(D7,'Tabela de Perfis'!A:B,2,0)*'Calcular Lista'!AA7/1000)","v":""}]
[null,null,null,null,null,null,null,null,null,null,null,null,null,null,null,null,null,null,null,null,null,null,null,null,null,null,null,{"$f":"IF(C8=\"\",\"\",VLOOKUP(D8,'Tabela de Perfis'!A:B,2,0)*'Calcular Lista'!AA8/1000)","v":""}]
[null,null,null,null,null,null,null,null,null,null,null,null,null,null,null,null,null,null,null,null,null,null,null,null,null,null,null,{"$f":"IF(C9=\"\",\"\",VLOOKUP(D9,'Tabela de Perfis'!A:B,2,0)*'Calcular Lista'!AA9/1000)","v":""}]
[null,null,null,null,null,null,null,null,null,null,null,null,null,null,null,null,null,null,null,null,null,null,null,null,null,null,null,{"$f":"IF(C10=\"\",\"\",VLOOKUP(D10,'Tabela de Perfis'!A:B,2,0)*'Calcular Lista'!AA10/1000)","v":""}]
[null,null,null,null,null,null,null,null,null,null,null,null,null,null,null,null,null,null,null,null,null,null,null,null,null,null,null,{"$f":"IF(C11=\"\",\"\",VLOOKUP(D11,'Tabela de Perfis'!A:B,2,0)*'Calcular Lista'!AA11/1000)","v":""}]
[null,null,null,null,null,null,null,null,null,null,null,null,null,null,null,null,null,null,null,null,null,null,null,null,null,null,null,{"$f":"IF(C12=\"\",\"\",VLOOKUP(D12,'Tabela de Perfis'!A:B,2,0)*'Calcular Lista'!AA12/1000)","v":""}]
[null,null,null,null,null,null,null,null,null,null,null,null,null,null,null,null,null,null,null,null,null,null,null,null,null,null,null,{"$f":"IF(C13=\"\",\"\",VLOOKUP(D13,'Tabela de Perfis'!A:B,2,0)*'Calcular Lista'!AA13/1000)","v":""}]
[null,null,null,null,null,null,null,null,null,null,null,null,null,null,null,null,null,null,null,null,null,null,null,null,null,null,null,{"$f":"IF(C14=\"\",\"\",VLOOKUP(D14,'Tabela de Perfis'!A:B,2,0)*'Calcular Lista'!AA14/1000)","v":""}]
[null,null,null,null,null,null,null,null,null,null,null,null,null,null,null,null,null,null,null,null,null,null,null,null,null,null,null,{"$f":"IF(C15=\"\",\"\",VLOOKUP(D15,'Tabela de Perfis'!A:B,2,0)*'Calcular Lista'!AA15/1000)","v":""}]
[null,null,null,null,null,null,null,null,null,null,null,null,null,null,null,null,null,null,null,null,null,null,null,null,null,null,null,{"$f":"IF(C16=\"\",\"\",VLOOKUP(D16,'Tabela de Perfis'!A:B,2,0)*'Calcular Lista'!AA16/1000)","v":""}]
[null,null,null,null,null,null,null,null,null,null,null,null,null,null,null,null,null,null,null,null,null,null,null,null,null,null,null,{"$f":"IF(C17=\"\",\"\",VLOOKUP(D17,'Tabela de Perfis'!A:B,2,0)*'Calcular Lista'!AA17/1000)","v":""}]
[null,null,null,null,null,null,null,null,null,null,null,null,null,null,null,null,null,null,null,null,null,null,null,null,null,null,null,{"$f":"IF(C18=\"\",\"\",VLOOKUP(D18,'Tabela de Perfis'!A:B,2,0)*'Calcular Lista'!AA18/1000)","v":""}]
[null,null,null,null,null,null,null,null,null,null,null,null,null,null,null,null,null,null,null,null,null,null,null,null,null,null,null,{"$f":"IF(C19=\"\",\"\",VLOOKUP(D19,'Tabela de Perfis'!A:B,2,0)*'Calcular Lista'!AA19/1000)","v":""}]
[null,null,null,null,null,null,null,null,null,null,null,null,null,null,null,null,null,null,null,null,null,null,null,null,null,null,null,{"$f":"IF(C20=\"\",\"\",VLOOKUP(D20,'Tabela de Perfis'!A:B,2,0)*'Calcular Lista'!AA20/1000)","v":""}]
[null,null,null,null,null,null,null,null,null,null,null,null,null,null,null,null,null,null,null,null,null,null,null,null,null,null,null,{"$f":"IF(C21=\"\",\"\",VLOOKUP(D21,'Tabela de Perfis'!A:B,2,0)*'Calcular Lista'!AA21/1000)","v":""}]
[null,null,null,null,null,null,null,null,null,null,null,null,null,null,null,null,null,null,null,null,null,null,null,null,null,null,null,{"$f":"IF(C22=\"\",\"\",VLOOKUP(D22,'Tabela de Perfis'!A:B,2,0)*'Calcular Lista'!AA22/1000)","v":""}]
[null,null,null,null,null,null,null,null,null,null,null,null,null,null,null,null,null,null,null,null,null,null,null,null,null,null,null,{"$f":"IF(C23=\"\",\"\",VLOOKUP(D23,'Tabela de Perfis'!A:B,2,0)*'Calcular Lista'!AA23/1000)","v":""}]
[null,null,null,null,null,null,null,null,null,null,null,null,null,null,null,null,null,null,null,null,null,null,null,null,null,null,null,{"$f":"IF(C24=\"\",\"\",VLOOKUP(D24,'Tabela de Perfis'!A:B,2,0)*'Calcular Lista'!AA24/1000)","v":""}]
[null,null,null,null,null,null,null,null,null,null,null,null,null,null,null,null,null,null,null,null,null,null,null,null,null,null,null,{"$f":"IF(C25=\"\",\"\",VLOOKUP(D25,'Tabela de Perfis'!A:B,2,0)*'Calcular Lista'!AA25/1000)","v":""}]
[null,null,null,null,null,null,null,null,null,null,null,null,null,null,null,null,null,null,null,null,null,null,null,null,null,null,null,{"$f":"IF(C26=\"\",\"\",VLOOKUP(D26,'Tabela de Perfis'!A:B,2,0)*'Calcular Lista'!AA26/1000)","v":""}]
[null,null,null,null,null,null,null,null,null,null,null,null,null,null,null,null,null,null,null,null,null,null,null,null,null,null,null,{"$f":"IF(C27=\"\",\"\",VLOOKUP(D27,'Tabela de Perfis'!A:B,2,0)*'Calcular Lista'!AA27/1000)","v":""}]
[null,null,null,null,null,null,null,null,null,null,null,null,null,null,null,null,null,null,null,null,null,null,null,null,null,null,null,{"$f":"IF(C28=\"\",\"\",VLOOKUP(D28,'Tabela de Perfis'!A:B,2,0)*'Calcular Lista'!AA28/1000)","v":""}]
[null,null,null,null,null,null,null,null,null,null,null,null,null,null,null,null,null,null,null,null,null,null,null,null,null,null,null,{"$f":"IF(C29=\"\",\"\",VLOOKUP(D29,'Tabela de Perfis'!A:B,2,0)*'Calcular Lista'!AA29/1000)","v":""}]
[null,null,null,null,null,null,null,null,null,null,null,null,null,null,null,null,null,null,null,null,null,null,null,null,null,null,null,{"$f":"IF(C30=\"\",\"\",VLOOKUP(D30,'Tabela de Perfis'!A:B,2,0)*'Calcular Lista'!AA30/1000)","v":""}]
[null,null,null,null,null,null,null,null,null,null,null,null,null,null,null,null,null,null,null,null,null,null,null,null,null,null,null,{"$f":"IF(C31=\"\",\"\",VLOOKUP(D31,'Tabela de Perfis'!A:B,2,0)*'Calcular Lista'!AA31/1000)","v":""}]
[null,null,null,null,null,null,null,null,null,null,null,null,null,null,null,null,null,null,null,null,null,null,null,null,null,null,null,{"$f":"IF(C32=\"\",\"\",VLOOKUP(D32,'Tabela de Perfis'!A:B,2,0)*'Calcular Lista'!AA32/1000)","v":""}]
[null,null,null,null,null,null,null,null,null,null,null,null,null,null,null,null,null,null,null,null,null,null,null,null,null,null,null,{"$f":"IF(C33=\"\",\"\",VLOOKUP(D33,'Tabela de Perfis'!A:B,2,0)*'Calcular Lista'!AA33/1000)","v":""}]
[null,null,null,null,null,null,null,null,null,null,null,null,null,null,null,null,null,null,null,null,null,null,null,null,null,null,null,{"$f":"IF(C34=\"\",\"\",VLOOKUP(D34,'Tabela de Perfis'!A:B,2,0)*'Calcular Lista'!AA34/1000)","v":""}]
[null,null,null,null,null,null,null,null,null,null,null,null,null,null,null,null,null,null,null,null,null,null,null,null,null,null,null,{"$f":"IF(C35=\"\",\"\",VLOOKUP(D35,'Tabela de Perfis'!A:B,2,0)*'Calcular Lista'!AA35/1000)","v":""}]
[null,null,null,null,null,null,null,null,null,null,null,null,null,null,null,null,null,null,null,null,null,null,null,null,null,null,null,{"$f":"IF(C36=\"\",\"\",VLOOKUP(D36,'Tabela de Perfis'!A:B,2,0)*'Calcular Lista'!AA36/1000)","v":""}]
[null,null,null,null,null,null,null,null,null,null,null,null,null,null,null,null,null,null,null,null,null,null,null,null,null,null,null,{"$f":"IF(C37=\"\",\"\",VLOOKUP(D37,'Tabela de Perfis'!A:B,2,0)*'Calcular Lista'!AA37/1000)","v":""}]
[null,null,null,null,null,null,null,null,null,null,null,null,null,null,null,null,null,null,null,null,null,null,null,null,null,null,null,{"$f":"IF(C38=\"\",\"\",VLOOKUP(D38,'Tabela de Perfis'!A:B,2,0)*'Calcular Lista'!AA38/1000)","v":""}]
[null,null,null,null,null,null,null,null,null,null,null,null,null,null,null,null,null,null,null,null,null,null,null,null,null,null,null,{"$f":"IF(C39=\"\",\"\",VLOOKUP(D39,'Tabela de Perfis'!A:B,2,0)*'Calcular Lista'!AA39/1000)","v":""}]
[null,null,null,null,null,null,null,null,null,null,null,null,null,null,null,null,null,null,null,null,null,null,null,null,null,null,null,{"$f":"IF(C40=\"\",\"\",VLOOKUP(D40,'Tabela de Perfis'!A:B,2,0)*'Calcular Lista'!AA40/1000)","v":""}]
[null,null,null,null,null,null,null,null,null,null,null,null,null,null,null,null,null,null,null,null,null,null,null,null,null,null,null,{"$f":"IF(C41=\"\",\"\",VLOOKUP(D41,'Tabela de Perfis'!A:B,2,0)*'Calcular Lista'!AA41/1000)","v":""}]
[null,null,null,null,null,null,null,null,null,null,null,null,null,null,null,null,null,null,null,null,null,null,null,null,null,null,null,{"$f":"IF(C42=\"\",\"\",VLOOKUP(D42,'Tabela de Perfis'!A:B,2,0)*'Calcular Lista'!AA42/1000)","v":""}]
[null,null,null,null,null,null,null,null,null,null,null,null,null,null,null,null,null,null,null,null,null,null,null,null,null,null,null,{"$f":"IF(C43=\"\",\"\",VLOOKUP(D43,'Tabela de Perfis'!A:B,2,0)*'Calcular Lista'!AA43/1000)","v":""}]
[null,null,null,null,null,null,null,null,null,null,null,null,null,null,null,null,null,null,null,null,null,null,null,null,null,null,null,{"$f":"IF(C44=\"\",\"\",VLOOKUP(D44,'Tabela de Perfis'!A:B,2,0)*'Calcular Lista'!AA44/1000)","v":""}]
[null,null,null,null,null,null,null,null,null,null,null,null,null,null,null,null,null,null,null,null,null,null,null,null,null,null,null,{"$f":"IF(C45=\"\",\"\",VLOOKUP(D45,'Tabela de Perfis'!A:B,2,0)*'Calcular Lista'!AA45/1000)","v":""}]
[null,null,null,null,null,null,null,null,null,null,null,null,null,null,null,null,null,null,null,null,null,null,null,null,null,null,null,{"$f":"IF(C46=\"\",\"\",VLOOKUP(D46,'Tabela de Perfis'!A:B,2,0)*'Calcular Lista'!AA46/1000)","v":""}]
[null,null,null,null,null,null,null,null,null,null,null,null,null,null,null,null,null,null,null,null,null,null,null,null,null,null,null,{"$f":"IF(C47=\"\",\"\",VLOOKUP(D47,'Tabela de Perfis'!A:B,2,0)*'Calcular Lista'!AA47/1000)","v":""}]
[null,null,null,null,null,null,null,null,null,null,null,null,null,null,null,null,null,null,null,null,null,null,null,null,null,null,null,{"$f":"IF(C48=\"\",\"\",VLOOKUP(D48,'Tabela de Perfis'!A:B,2,0)*'Calcular Lista'!AA48/1000)","v":""}]
[null,null,null,null,null,null,null,null,null,null,null,null,null,null,null,null,null,null,null,null,null,null,null,null,null,null,null,{"$f":"IF(C49=\"\",\"\",VLOOKUP(D49,'Tabela de Perfis'!A:B,2,0)*'Calcular Lista'!AA49/1000)","v":""}]
[null,null,null,null,null,null,null,null,null,null,null,null,null,null,null,null,null,null,null,null,null,null,null,null,null,null,null,{"$f":"IF(C50=\"\",\"\",VLOOKUP(D50,'Tabela de Perfis'!A:B,2,0)*'Calcular Lista'!AA50/1000)","v":""}]
[null,null,null,null,null,null,null,null,null,null,null,null,null,null,null,null,null,null,null,null,null,null,null,null,null,null,null,{"$f":"IF(C51=\"\",\"\",VLOOKUP(D51,'Tabela de Perfis'!A:B,2,0)*'Calcular Lista'!AA51/1000)","v":""}]
[null,null,null,null,null,null,null,null,null,null,null,null,null,null,null,null,null,null,null,null,null,null,null,null,null,null,null,{"$f":"IF(C52=\"\",\"\",VLOOKUP(D52,'Tabela de Perfis'!A:B,2,0)*'Calcular Lista'!AA52/1000)","v":""}]
[null,null,null,null,null,null,null,null,null,null,null,null,null,null,null,null,null,null,null,null,null,null,null,null,null,null,null,{"$f":"IF(C53=\"\",\"\",VLOOKUP(D53,'Tabela de Perfis'!A:B,2,0)*'Calcular Lista'!AA53/1000)","v":""}]
[null,null,null,null,null,null,null,null,null,null,null,null,null,null,null,null,null,null,null,null,null,null,null,null,null,null,null,{"$f":"IF(C54=\"\",\"\",VLOOKUP(D54,'Tabela de Perfis'!A:B,2,0)*'Calcular Lista'!AA54/1000)","v":""}]
[null,null,null,null,null,null,null,null,null,null,null,null,null,null,null,null,null,null,null,null,null,null,null,null,null,null,null,{"$f":"IF(C55=\"\",\"\",VLOOKUP(D55,'Tabela de Perfis'!A:B,2,0)*'Calcular Lista'!AA55/1000)","v":""}]
[null,null,null,null,null,null,null,null,null,null,null,null,null,null,null,null,null,null,null,null,null,null,null,null,null,null,null,{"$f":"IF(C56=\"\",\"\",VLOOKUP(D56,'Tabela de Perfis'!A:B,2,0)*'Calcular Lista'!AA56/1000)","v":""}]
[null,null,null,null,null,null,null,null,null,null,null,null,null,null,null,null,null,null,null,null,null,null,null,null,null,null,null,{"$f":"IF(C57=\"\",\"\",VLOOKUP(D57,'Tabela de Perfis'!A:B,2,0)*'Calcular Lista'!AA57/1000)","v":""}]
[null,null,null,null,null,null,null,null,null,null,null,null,null,null,null,null,null,null,null,null,null,null,null,null,null,null,null,{"$f":"IF(C58=\"\",\"\",VLOOKUP(D58,'Tabela de Perfis'!A:B,2,0)*'Calcular Lista'!AA58/1000)","v":""}]
[null,null,null,null,null,null,null,null,null,null,null,null,null,null,null,null,null,null,null,null,null,null,null,null,null,null,null,{"$f":"IF(C59=\"\",\"\",VLOOKUP(D59,'Tabela de Perfis'!A:B,2,0)*'Calcular Lista'!AA59/1000)","v":""}]
[null,null,null,null,null,null,null,null,null,null,null,null,null,null,null,null,null,null,null,null,null,null,null,null,null,null,null,{"$f":"IF(C60=\"\",\"\",VLOOKUP(D60,'Tabela de Perfis'!A:B,2,0)*'Calcular Lista'!AA60/1000)","v":""}]
[null,null,null,null,null,null,null,null,null,null,null,null,null,null,null,null,null,null,null,null,null,null,null,null,null,null,null,{"$f":"IF(C61=\"\",\"\",VLOOKUP(D61,'Tabela de Perfis'!A:B,2,0)*'Calcular Lista'!AA61/1000)","v":""}]
[null,null,null,null,null,null,null,null,null,null,null,null,null,null,null,null,null,null,null,null,null,null,null,null,null,null,null,{"$f":"IF(C62=\"\",\"\",VLOOKUP(D62,'Tabela de Perfis'!A:B,2,0)*'Calcular Lista'!AA62/1000)","v":""}]
[null,null,null,null,null,null,null,null,null,null,null,null,null,null,null,null,null,null,null,null,null,null,null,null,null,null,null,{"$f":"IF(C63=\"\",\"\",VLOOKUP(D63,'Tabela de Perfis'!A:B,2,0)*'Calcular Lista'!AA63/1000)","v":""}]
[null,null,null,null,null,null,null,null,null,null,null,null,null,null,null,null,null,null,null,null,null,null,null,null,null,null,null,{"$f":"IF(C64=\"\",\"\",VLOOKUP(D64,'Tabela de Perfis'!A:B,2,0)*'Calcular Lista'!AA64/1000)","v":""}]
[null,null,null,null,null,null,null,null,null,null,null,null,null,null,null,null,null,null,null,null,null,null,null,null,null,null,null,{"$f":"IF(C65=\"\",\"\",VLOOKUP(D65,'Tabela de Perfis'!A:B,2,0)*'Calcular Lista'!AA65/1000)","v":""}]
[null,null,null,null,null,null,null,null,null,null,null,null,null,null,null,null,null,null,null,null,null,null,null,null,null,null,null,{"$f":"IF(C66=\"\",\"\",VLOOKUP(D66,'Tabela de Perfis'!A:B,2,0)*'Calcular Lista'!AA66/1000)","v":""}]
[null,null,null,null,null,null,null,null,null,null,null,null,null,null,null,null,null,null,null,null,null,null,null,null,null,null,null,{"$f":"IF(C67=\"\",\"\",VLOOKUP(D67,'Tabela de Perfis'!A:B,2,0)*'Calcular Lista'!AA67/1000)","v":""}]
[null,null,null,null,null,null,null,null,null,null,null,null,null,null,null,null,null,null,null,null,null,null,null,null,null,null,null,{"$f":"IF(C68=\"\",\"\",VLOOKUP(D68,'Tabela de Perfis'!A:B,2,0)*'Calcular Lista'!AA68/1000)","v":""}]
[null,null,null,null,null,null,null,null,null,null,null,null,null,null,null,null,null,null,null,null,null,null,null,null,null,null,null,{"$f":"IF(C69=\"\",\"\",VLOOKUP(D69,'Tabela de Perfis'!A:B,2,0)*'Calcular Lista'!AA69/1000)","v":""}]
[null,null,null,null,null,null,null,null,null,null,null,null,null,null,null,null,null,null,null,null,null,null,null,null,null,null,null,{"$f":"IF(C70=\"\",\"\",VLOOKUP(D70,'Tabela de Perfis'!A:B,2,0)*'Calcular Lista'!AA70/1000)","v":""}]
[null,null,null,null,null,null,null,null,null,null,null,null,null,null,null,null,null,null,null,null,null,null,null,null,null,null,null,{"$f":"IF(C71=\"\",\"\",VLOOKUP(D71,'Tabela de Perfis'!A:B,2,0)*'Calcular Lista'!AA71/1000)","v":""}]
[null,null,null,null,null,null,null,null,null,null,null,null,null,null,null,null,null,null,null,null,null,null,null,null,null,null,null,{"$f":"IF(C72=\"\",\"\",VLOOKUP(D72,'Tabela de Perfis'!A:B,2,0)*'Calcular Lista'!AA72/1000)","v":""}]
[null,null,null,null,null,null,null,null,null,null,null,null,null,null,null,null,null,null,null,null,null,null,null,null,null,null,null,{"$f":"IF(C73=\"\",\"\",VLOOKUP(D73,'Tabela de Perfis'!A:B,2,0)*'Calcular Lista'!AA73/1000)","v":""}]
[null,null,null,null,null,null,null,null,null,null,null,null,null,null,null,null,null,null,null,null,null,null,null,null,null,null,null,{"$f":"IF(C74=\"\",\"\",VLOOKUP(D74,'Tabela de Perfis'!A:B,2,0)*'Calcular Lista'!AA74/1000)","v":""}]
[null,null,null,null,null,null,null,null,null,null,null,null,null,null,null,null,null,null,null,null,null,null,null,null,null,null,null,{"$f":"IF(C75=\"\",\"\",VLOOKUP(D75,'Tabela de Perfis'!A:B,2,0)*'Calcular Lista'!AA75/1000)","v":""}]
[null,null,null,null,null,null,null,null,null,null,null,null,null,null,null,null,null,null,null,null,null,null,null,null,null,null,null,{"$f":"IF(C76=\"\",\"\",VLOOKUP(D76,'Tabela de Perfis'!A:B,2,0)*'Calcular Lista'!AA76/1000)","v":""}]
[null,null,null,null,null,null,null,null,null,null,null,null,null,null,null,null,null,null,null,null,null,null,null,null,null,null,null,{"$f":"IF(C77=\"\",\"\",VLOOKUP(D77,'Tabela de Perfis'!A:B,2,0)*'Calcular Lista'!AA77/1000)","v":""}]
[null,null,null,null,null,null,null,null,null,null,null,null,null,null,null,null,null,null,null,null,null,null,null,null,null,null,null,{"$f":"IF(C78=\"\",\"\",VLOOKUP(D78,'Tabela de Perfis'!A:B,2,0)*'Calcular Lista'!AA78/1000)","v":""}]
[null,null,null,null,null,null,null,null,null,null,null,null,null,null,null,null,null,null,null,null,null,null,null,null,null,null,null,{"$f":"IF(C79=\"\",\"\",VLOOKUP(D79,'Tabela de Perfis'!A:B,2,0)*'Calcular Lista'!AA79/1000)","v":""}]
[null,null,null,null,null,null,null,null,null,null,null,null,null,null,null,null,null,null,null,null,null,null,null,null,null,null,null,{"$f":"IF(C80=\"\",\"\",VLOOKUP(D80,'Tabela de Perfis'!A:B,2,0)*'Calcular Lista'!AA80/1000)","v":""}]
[null,null,null,null,null,null,null,null,null,null,null,null,null,null,null,null,null,null,null,null,null,null,null,null,null,null,null,{"$f":"IF(C81=\"\",\"\",VLOOKUP(D81,'Tabela de Perfis'!A:B,2,0)*'Calcular Lista'!AA81/1000)","v":""}]
[null,null,null,null,null,null,null,null,null,null,null,null,null,null,null,null,null,null,null,null,null,null,null,null,null,null,null,{"$f":"IF(C82=\"\",\"\",VLOOKUP(D82,'Tabela de Perfis'!A:B,2,0)*'Calcular Lista'!AA82/1000)","v":""}]
[null,null,null,null,null,null,null,null,null,null,null,null,null,null,null,null,null,null,null,null,null,null,null,null,null,null,null,{"$f":"IF(C83=\"\",\"\",VLOOKUP(D83,'Tabela de Perfis'!A:B,2,0)*'Calcular Lista'!AA83/1000)","v":""}]
[null,null,null,null,null,null,null,null,null,null,null,null,null,null,null,null,null,null,null,null,null,null,null,null,null,null,null,{"$f":"IF(C84=\"\",\"\",VLOOKUP(D84,'Tabela de Perfis'!A:B,2,0)*'Calcular Lista'!AA84/1000)","v":""}]
[null,null,null,null,null,null,null,null,null,null,null,null,null,null,null,null,null,null,null,null,null,null,null,null,null,null,null,{"$f":"IF(C85=\"\",\"\",VLOOKUP(D85,'Tabela de Perfis'!A:B,2,0)*'Calcular Lista'!AA85/1000)","v":""}]
[null,null,null,null,null,null,null,null,null,null,null,null,null,null,null,null,null,null,null,null,null,null,null,null,null,null,null,{"$f":"IF(C86=\"\",\"\",VLOOKUP(D86,'Tabela de Perfis'!A:B,2,0)*'Calcular Lista'!AA86/1000)","v":""}]
[null,null,null,null,null,null,null,null,null,null,null,null,null,null,null,null,null,null,null,null,null,null,null,null,null,null,null,{"$f":"IF(C87=\"\",\"\",VLOOKUP(D87,'Tabela de Perfis'!A:B,2,0)*'Calcular Lista'!AA87/1000)","v":""}]
[null,null,null,null,null,null,null,null,null,null,null,null,null,null,null,null,null,null,null,null,null,null,null,null,null,null,null,{"$f":"IF(C88=\"\",\"\",VLOOKUP(D88,'Tabela de Perfis'!A:B,2,0)*'Calcular Lista'!AA88/1000)","v":""}]
[null,null,null,null,null,null,null,null,null,null,null,null,null,null,null,null,null,null,null,null,null,null,null,null,null,null,null,{"$f":"IF(C89=\"\",\"\",VLOOKUP(D89,'Tabela de Perfis'!A:B,2,0)*'Calcular Lista'!AA89/1000)","v":""}]
[null,null,null,null,null,null,null,null,null,null,null,null,null,null,null,null,null,null,null,null,null,null,null,null,null,null,null,{"$f":"IF(C90=\"\",\"\",VLOOKUP(D90,'Tabela de Perfis'!A:B,2,0)*'Calcular Lista'!AA90/1000)","v":""}]

{"sheet":"Tabela de Perfis","index":8,"n_rows":91,"n_cols":29,"rows_kept":91,"cut":false,"hidden":false,"merged":[[0,20,0,22],[0,23,1,23],[0,24,1,24],[0,25,1,25],[0,28,1,28],[0,19,1,19],[0,0,1,0],[0,1,1,1],[0,2,1,2],[0,3,1,3],[0,4,0,5],[0,6,1,6],[0,7,1,7],[0,8,1,8],[0,10,0,13],[0,14,0,17],[0,18,1,18]]}
["BITOLA","MASSA LINEAR","d","bf","ESPESSURA",null,"h","d’","ÁREA","PERIMETRO","EIXO X-X",null,null,null,"EIXO Y-Y",null,null,null,"rt","It","ESBELTEZ",null,null,"Cw","u","ÁREA REDUZIDA","*CARGA ADM EST","*CARGA ADM EST","BITOLA"]
[null,null,null,null,"tw","tf",null,null,null,"u","Ix","Wx","rx","Zx","Iy","Wy","ry","Zy",null,null,"ABA - λf ","ABA - λw ","Coef Red. Q",null,null,null,"(Q.A's.fy)/1,66","(Q.A's.fy)/2,00"]
["mm x kg/m","kg/m","mm","mm","mm","mm","mm","mm","cm²","cm","cm⁴","cm³","cm","cm³","cm⁴","cm³","cm","cm³","cm","cm⁴","bf/2t","d’/t","≤ 1,00","cm⁶","m³/m","cm²","tf","tf","mm x kg/m"]
["W 150 x 13,0",13,148,100,4.3,4.9000000000000004,138,118,16.600000000000001,67,635,85.8,6.18,96.4,82,16.399999999999999,2.2200000000000002,25.5,2.6,1.72,10.199999999999999,27.49,1,4181,0.67,{"$f":"AA4/2.1","v":6.6666666666666661},14,11.2,"W 150 x 13,0"]
["W 150 x 18,0",18,153,102,5.8,7.1,139,119,23.4,69,939,122.8,6.34,139.4,126,24.7,2.3199999999999998,38.5,2.69,4.34,7.18,20.48,1,6683,0.69,{"$f":"AA5/2.1","v":13.333333333333332},28,22.4,"W 150 x 18,0"]
["W 150 x 22,5 (H)",22.5,152,152,5.8,6.6,139,119,29,88,1229,161.69999999999999,6.51,179.6,387,50.9,3.65,77.900000000000006,4.0999999999999996,4.75,11.52,20.48,1,20417,0.88,15.714285714285714,33,26.4,"W 150 x 22,5 (H)"]
["W 150 x 24,0",24,160,102,6.6,10.3,139,115,31.5,69,1384,173,6.63,197.6,183,35.9,2.41,55.8,2.73,11.08,4.95,17.48,1,10206,0.69,20.952380952380953,44,35.200000000000003,"W 150 x 24,0"]
["W 150 x 29,8 (H)",29.8,157,153,6.6,9.3000000000000007,138,118,38.5,90,1739,221.5,6.72,247.5,556,72.599999999999994,3.8,110.8,4.18,10.95,8.23,17.940000000000001,1,30277,0.9,25.238095238095237,53,42.4,"W 150 x 29,8 (H)"]
["W 150 x 37,1 (H)",37.1,162,154,8.1,11.6,139,119,47.8,91,2244,277,6.85,313.5,707,91.8,3.84,140.4,4.22,20.58,6.64,14.67,1,39930,0.91,34.285714285714285,72,57.6,"W 150 x 37,1 (H)"]
["W 200 x 15,0",15,200,100,4.3,5.2,190,170,19.399999999999999,77,1305,130.5,8.1999999999999993,147.9,87,17.399999999999999,2.12,27.3,2.5499999999999998,2.0499999999999998,9.6199999999999992,39.44,0.95,8222,0.77,7.6190476190476186,16,12.8,"W 200 x 15,0"]
["W 200 x 19,3",19.3,203,102,5.8,6.5,190,170,25.1,79,1686,166.1,8.19,190.6,116,22.7,2.14,35.9,2.59,4.0199999999999996,7.85,29.31,1,11098,0.79,13.333333333333332,28,22.4,"W 200 x 19,3"]
["W 200 x 22,5",22.5,206,102,6.2,8,190,170,29,79,2029,197,8.3699999999999992,225.5,142,27.9,2.2200000000000002,43.9,2.63,6.18,6.38,27.42,1,13868,0.79,17.142857142857142,36,28.8,"W 200 x 22,5"]
["W 200 x 26,6",26.6,207,133,5.8,8.4,190,170,34.200000000000003,92,2611,252.3,8.73,282.3,330,49.6,3.1,76.3,3.54,7.65,7.92,29.34,1,32477,0.92,20.476190476190474,43,34.4,"W 200 x 26,6"]
["W 200 x 31,3",31.3,210,134,6.4,10.199999999999999,190,170,40.299999999999997,93,3168,301.7,8.86,338.6,410,61.2,3.19,94,3.6,12.59,6.57,26.5,1,40822,0.93,26.666666666666664,56,44.8,"W 200 x 31,3"]
["W 200 x 35,9 (H)",35.9,201,165,6.2,10.199999999999999,181,161,45.7,103,3437,342,8.67,379.2,764,92.6,4.09,141,4.5,14.51,8.09,25.9,1,69502,1.03,30.476190476190474,64,51.2,"W 200 x 35,9 (H)"]
["W 200 x 41,7 (H)",41.7,205,166,7.2,11.8,181,157,53.5,104,4114,401.4,8.77,448.6,901,108.5,4.0999999999999996,165.7,4.53,23.19,7.03,21.86,1,83948,1.04,38.095238095238095,80,64,"W 200 x 41,7 (H)"]
["W 200 x 46,1 (H)",46.1,203,203,7.2,11,181,161,58.6,119,4543,447.6,8.81,495.3,1535,151.19999999999999,5.12,229.5,5.58,22.01,9.23,22.36,1,141342,1.19,40.952380952380949,86,68.8,"W 200 x 46,1 (H)"]
["W 200 x 52,0 (H)",52,206,204,7.9,12.6,181,157,66.900000000000006,119,5298,514.4,8.9,572.5,1784,174.9,5.16,265.8,5.61,33.340000000000003,8.1,19.850000000000001,1,166710,1.19,49.523809523809518,104,83.2,"W 200 x 52,0 (H)"]
["HP 200 x 53,0 (H)",53,204,207,11.3,11.3,181,161,68.099999999999994,120,4977,488,8.5500000000000007,551.29999999999995,1673,161.69999999999999,4.96,248.6,5.57,31.93,9.16,14.28,1,155075,1.2,50.476190476190474,106,84.8,"HP 200 x 53,0 (H)"]
["W 200 x 59,0 (H)",59,210,205,9.1,14.2,182,158,76,120,6140,584.79999999999995,8.99,655.9,2041,199.1,5.18,303,5.64,47.69,7.22,17.32,1,195418,1.2,58.095238095238095,122,97.6,"W 200 x 59,0 (H)"]
["W 200 x 71,0 (H)",71,216,206,10.199999999999999,17.399999999999999,181,161,91,122,7660,709.2,9.17,803.2,2537,246.3,5.28,374.5,5.7,81.66,5.92,15.8,1,249976,1.22,73.333333333333329,154,123.2,"W 200 x 71,0 (H)"]
["W 200 x 86,0 (H)",86,222,209,13,20.6,181,157,110.9,123,9498,855.7,9.26,984.2,3139,300.39999999999998,5.32,458.7,5.77,142.19,5.07,12.06,1,317844,1.23,92.857142857142847,195,156,"W 200 x 86,0 (H)"]
["W 250 x 17,9",17.899999999999999,251,101,4.8,5.3,240,220,23.1,88,2291,182.6,9.9600000000000009,211,91,18.100000000000001,1.99,28.8,2.48,2.54,9.5299999999999994,45.92,0.9,13735,0.88,9.0476190476190474,19,15.2,"W 250 x 17,9"]
["W 250 x 22,3",22.3,254,102,5.8,6.9,240,220,28.9,89,2939,231.4,10.09,267.7,123,24.1,2.06,38.4,2.54,4.7699999999999996,7.39,37.97,0.96,18629,0.89,14.761904761904761,31,24.8,"W 250 x 22,3"]
["W 250 x 25,3",25.3,257,102,6.1,8.4,240,220,32.6,89,3473,270.2,10.31,311.10000000000002,149,29.3,2.14,46.4,2.58,7.06,6.07,36.1,0.98,22955,0.89,19.047619047619047,40,32,"W 250 x 25,3"]
["W 250 x 28,4",28.4,260,102,6.4,10,240,220,36.6,90,4046,311.2,10.51,357.3,178,34.799999999999997,2.2000000000000002,54.9,2.62,10.34,5.0999999999999996,34.380000000000003,1,27636,0.9,23.333333333333332,49,39.200000000000003,"W 250 x 28,4"]
["W 250 x 32,7",32.700000000000003,258,146,6.1,9.1,240,220,42.1,107,4937,382.7,10.83,428.5,473,64.8,3.35,99.7,3.86,10.44,8.02,36.03,0.98,73104,1.07,25.714285714285712,54,43.2,"W 250 x 32,7"]
["W 250 x 38,5",38.5,262,147,6.6,11.2,240,220,49.6,108,6057,462.4,11.05,517.79999999999995,594,80.8,3.46,124.1,3.93,17.63,6.56,33.270000000000003,1,93242,1.08,33.333333333333329,70,56,"W 250 x 38,5"]
["W 250 x 44,8",44.8,266,148,7.6,13,240,220,57.6,109,7158,538.20000000000005,11.15,606.29999999999995,704,95.1,3.5,146.4,3.96,27.14,5.69,28.95,1,112398,1.0900000000000001,41.428571428571423,87,69.599999999999994,"W 250 x 44,8"]
["HP 250 x 62,0 (H)",62,246,256,10.5,10.7,225,201,79.599999999999994,147,8728,709.6,10.47,790.5,2995,234,6.13,357.8,6.89,33.46,11.96,19.100000000000001,1,414130,1.47,57.619047619047613,121,96.8,"HP 250 x 62,0 (H)"]
["W 250 x 73,0 (H)",73,253,254,8.6,14.2,225,201,92.7,148,11257,889.9,11.02,983.3,3880,305.5,6.47,463.1,7.01,56.94,8.94,23.33,1,552900,1.48,70.952380952380949,149,119.2,"W 250 x 73,0 (H)"]
["W 250 x 80,0 (H)",80,256,255,9.4,15.6,225,201,101.9,149,12550,980.5,11.1,1088.7,4313,338.3,6.51,513.1,7.04,75.02,8.17,21.36,1,622878,1.49,80,168,134.4,"W 250 x 80,0 (H)"]
["HP 250 x 85,0 (H)",85,254,260,14.4,14.4,225,201,108.5,150,1228,966.9,10.64,1093.2,4225,325,6.24,499.6,7,82.07,9.0299999999999994,13.97,1,605403,1.5,86.666666666666657,182,145.6,"HP 250 x 85,0 (H)"]
["W 250 x 89,0 (H)",89,260,256,10.7,17.3,225,201,113.9,150,14237,1095.0999999999999,11.18,1224.4000000000001,4841,378.2,6.52,574.29999999999995,7.06,102.81,7.4,18.82,1,712351,1.5,91.904761904761898,193,154.4,"W 250 x 89,0 (H)"]
["W 250 x 101,0 (H)",101,264,257,11.9,19.600000000000001,225,201,128.69999999999999,151,16352,1238.8,11.27,1395,5549,431.8,6.57,656.3,7.1,147.69999999999999,6.56,16.87,1,828031,1.51,106.66666666666666,224,179.2,"W 250 x 101,0 (H)"]
["W 250 x 115,0 (H)",115,269,259,13.5,22.1,225,201,146.1,153,18920,1406.7,11.38,1597.4,6405,494.6,6.62,752.7,7.16,212,5.86,14.87,1,975265,1.53,123.80952380952381,260,208,"W 250 x 115,0 (H)"]
["W 310 x 21,0",21,303,101,5.0999999999999996,5.7,292,272,27.2,98,3776,249.2,11.77,291.89999999999998,98,19.5,1.9,31.4,2.42,3.27,8.86,53.25,0.84,21628,0.98,10.476190476190476,22,17.600000000000001,"W 310 x 21,0"]
["W 310 x 23,8",23.8,305,101,5.6,6.7,292,272,30.7,99,4346,285,11.89,333.2,116,22.9,1.94,36.9,2.4500000000000002,4.6500000000000004,7.54,48.5,0.87,25594,0.99,13.809523809523808,29,23.2,"W 310 x 23,8"]
["W 310 x 28,3",28.3,309,102,6,8.9,291,271,36.5,100,5500,356,12.28,412,158,31,2.08,49.4,2.5499999999999998,8.14,5.73,45.2,0.91,35441,1,19.523809523809522,41,32.799999999999997,"W 310 x 28,3"]
["W 310 x 32,7",32.700000000000003,313,102,6.6,10.8,291,271,42.1,100,6570,419.8,12.49,485.3,192,37.6,2.13,59.8,2.58,12.91,4.72,41.12,0.94,43612,1,25.714285714285712,54,43.2,"W 310 x 32,7"]
["W 310 x 38,7",38.700000000000003,310,165,5.8,9.6999999999999993,291,271,49.7,125,8581,553.6,13.14,615.4,727,88.1,3.82,134.9,4.38,13.2,8.51,46.66,0.93,163728,1.25,29.047619047619047,61,48.8,"W 310 x 38,7"]
["W 310 x 44,5",44.5,313,166,6.6,11.2,291,271,57.2,126,9997,638.79999999999995,13.22,712.8,855,103,3.87,158,4.41,19.899999999999999,7.41,41,0.93,194433,1.26,36.666666666666664,77,61.6,"W 310 x 44,5"]
["W 310 x 52,0",52,317,167,7.6,13.2,291,271,67,127,11909,751.4,13.33,842.5,1026,122.9,3.91,188.8,4.45,31.81,6.33,35.61,1,236422,1.27,48.095238095238095,101,80.8,"W 310 x 52,0"]
["HP 310 x 79,0 (H)",79,299,306,11,11,277,245,100,177,16316,1091.3,12.77,1210.0999999999999,5258,343.7,7.25,525.4,8.1999999999999993,46.72,13.91,22.27,0.99,1089258,1.77,72.857142857142847,153,122.4,"HP 310 x 79,0 (H)"]
["HP 310 x 93,0 (H)",93,303,308,13.1,13.1,277,245,119.2,178,19682,1299.0999999999999,12.85,1450.3,6387,414.7,7.32,635.5,8.26,77.33,11.76,18.690000000000001,1,1340320,1.78,92.857142857142847,195,156,"HP 310 x 93,0 (H)"]
["W 310 x 97,0 (H)",97,308,305,9.9,15.4,277,245,123.6,179,22284,1447,13.43,1594.2,7286,477.8,7.68,725,8.3800000000000008,92.12,9.9,24.77,1,1558682,1.79,97.142857142857139,204,163.19999999999999,"W 310 x 97,0 (H)"]
["W 310 x 107,0 (H)",107,311,306,10.9,17,277,245,136.4,180,24839,1597.3,13.49,1768.2,8123,530.9,7.72,806.1,8.41,122.86,9,22.48,1,1754271,1.8,110,231,184.8,"W 310 x 107,0 (H)"]
["HP 310 x 110,0 (H)",110,308,310,15.4,15.5,277,245,141,180,23703,1539.1,12.97,1730.6,7707,497.3,7.39,763.7,8.33,125.66,10,15.91,1,1646104,1.8,114.76190476190476,241,192.8,"HP 310 x 110,0 (H)"]
["W 310 x 117,0 (H)",117,314,307,11.9,18.7,277,245,149.9,180,27563,1755.6,13.56,1952.6,9024,587.9,7.76,893.1,8.44,161.61000000000001,8.2100000000000009,20.55,1,1965950,1.8,123.33333333333333,259,207.2,"W 310 x 117,0 (H)"]
["HP 310 x 125,0 (H)",125,312,312,17.399999999999999,17.399999999999999,277,245,159,181,27076,1735.6,13.05,1963.3,8823,565.6,7.45,870.6,8.3800000000000008,177.98,8.9700000000000006,14.09,1,1911029,1.81,132.38095238095238,278,222.4,"HP 310 x 125,0 (H)"]
["W 360 x 32,9",32.9,349,127,5.8,8.5,332,308,42.1,117,8358,479,14.09,547.6,291,45.9,2.63,72,3.2,9.15,7.47,53.1,0.87,84111,1.17,21.428571428571427,45,36,"W 360 x 32,9"]
["W 360 x 39,0",39,353,128,6.5,10.7,332,308,50.2,118,10331,585.29999999999995,14.35,667.7,375,58.6,2.73,91.9,3.27,15.83,5.98,47.32,0.91,109551,1.18,29.523809523809522,62,49.6,"W 360 x 39,0"]
["W 360 x 44,0",44,352,171,6.9,9.8000000000000007,332,308,57.7,135,12258,696.5,14.58,784.3,818,95.7,3.77,148,4.43,16.7,8.7200000000000006,44.7,0.93,239091,1.35,34.761904761904759,73,58.4,"W 360 x 44,0"]
["W 360 x 51,0",51,355,171,7.2,11.6,332,308,64.8,136,14222,801.2,14.81,899.5,968,113.3,3.87,174.7,4.49,24.65,7.37,42.75,0.94,284994,1.36,41.904761904761905,88,70.400000000000006,"W 360 x 51,0"]
["W 360 x 57,8",57.8,358,172,7.9,13.1,332,308,72.5,137,16143,901.8,14.92,1014.8,1113,129.4,3.92,199.8,4.53,34.450000000000003,6.56,38.96,0.96,330394,1.37,50.476190476190474,106,84.8,"W 360 x 57,8"]
["W 360 x 64,0",64,347,203,7.7,13.5,320,288,81.7,146,17890,1031.0999999999999,14.8,1145.5,1885,185.7,4.8,284.5,5.44,44.57,7.52,37.4,0.98,523362,1.46,58.571428571428569,123,98.4,"W 360 x 64,0"]
["W 360 x 72,0",72,350,204,8.6,15.1,320,288,91.3,147,20169,1152.5,14.86,1285.9000000000001,2140,209.8,4.84,321.8,5.47,61.18,6.75,33.47,1,599082,1.47,69.523809523809518,146,116.8,"W 360 x 72,0"]
["W 360 x 79,0",79,354,205,9.4,16.8,320,288,101.2,148,22713,1283.2,14.98,1437,2416,235.7,4.8899999999999997,361.9,5.51,82.41,6.1,30.68,1,685701,1.48,79.523809523809518,167,133.6,"W 360 x 79,0"]
["W 360 x 91,0 (H)",91,353,254,9.5,16.399999999999999,320,288,115.9,168,26755,1515.9,15.19,1680.1,4483,353,6.22,538.1,6.9,92.61,7.74,30.34,1,1268709,1.68,91.428571428571431,192,153.6,"W 360 x 91,0 (H)"]
["W 360 x 101,0 (H)",101,357,255,10.5,18.3,320,286,129.5,168,30279,1696.3,15.29,1888.9,5063,397.1,6.25,606.1,6.93,128.47,6.97,27.28,1,1450410,1.68,104.76190476190476,220,176,"W 360 x 101,0 (H)"]
["W 360 x 110,0 (H)",110,360,256,11.4,19.899999999999999,320,288,140.6,169,33155,1841.9,15.36,2059.3000000000002,5570,435.2,6.29,664.5,6.96,161.93,6.43,25.28,1,1609070,1.69,115.71428571428571,243,194.4,"W 360 x 110,0 (H)"]
["W 360 x 122,0 (H)",122,363,257,13,21.7,320,288,155.30000000000001,170,36599,2016.5,15.35,2269.8000000000002,6147,478.4,6.29,732.4,6.98,212.7,5.92,22.12,1,1787806,1.7,130.47619047619048,274,219.2,"W 360 x 122,0 (H)"]
["W 410 x 38,8",38.799999999999997,399,140,6.4,8.8000000000000007,381,357,50.3,132,12777,640.5,15.94,736.8,404,57.7,2.83,90.9,3.49,11.69,7.95,55.84,0.85,15319,1.32,25.714285714285712,54,43.2,"W 410 x 38,8"]
["W 410 x 46,1",46.1,403,140,7,11.2,381,357,59.2,133,15690,778.7,16.27,891.1,514,73.400000000000006,2.95,115.2,3.55,20.059999999999999,6.25,50.94,0.88,196571,1.33,34.761904761904759,73,58.4,"W 410 x 46,1"]
["W 410 x 53,0",53,403,177,7.5,10.9,381,357,68.400000000000006,148,18734,929.7,16.55,1052.2,1009,114,3.84,176.9,4.5599999999999996,23.38,8.1199999999999992,47.63,0.91,387194,1.48,41.904761904761905,88,70.400000000000006,"W 410 x 53,0"]
["W 410 x 60,0",60,407,178,7.7,12.8,381,357,76.2,149,21707,1066.7,16.88,1201.5,1205,135.4,3.98,209.2,4.6500000000000004,33.78,6.95,46.42,0.92,467404,1.49,49.523809523809518,104,83.2,"W 410 x 60,0"]
["W 410 x 67,0",67,410,179,8.8000000000000007,14.4,381,357,86.3,150,24678,1203.8,16.91,1362.7,1379,154.1,4,239,4.67,48.11,6.22,40.590000000000003,0.95,538546,1.5,60.952380952380949,128,102.4,"W 410 x 67,0"]
["W 410 x 75,0",75,413,180,9.6999999999999993,16,381,357,95.8,151,27616,1337.3,16.98,1518.6,1559,173.2,4.03,269.10000000000002,4.7,65.209999999999994,5.63,36.799999999999997,0.97,612784,1.51,71.428571428571431,150,120,"W 410 x 75,0"]
["W 410 x 85,0",85,417,181,10.9,18.2,381,357,108.6,152,31658,1518.4,17.07,1731.7,1804,199.3,4.08,310.39999999999998,4.74,94.48,4.97,32.72,1,715165,1.52,{"$f":"AA69/2.1","v":86.19047619047619},181,144.80000000000001,"W 410 x 85,0"]
["W 460 x 52,0",52,450,152,7.6,10.8,428,404,66.599999999999994,147,21370,949.8,17.91,1095.9000000000001,634,83.5,3.09,131.69999999999999,3.79,21.79,7.04,53.21,0.86,304837,1.47,38.571428571428569,81,64.8,"W 460 x 52,0"]
["W 460 x 60,0",60,455,153,8,13.3,428,404,76.2,149,25652,1127.5999999999999,18.350000000000001,1292.0999999999999,796,104.1,3.23,163.4,3.89,34.6,5.75,50.55,0.88,387230,1.49,47.61904761904762,100,80,"W 460 x 60,0"]
["W 460 x 68,0",68,459,154,9.1,15.4,428,404,87.6,150,29851,1300.7,18.46,1495.4,941,122.2,3.28,192.4,3.93,52.29,5,44.42,0.92,461163,1.5,60,126,100.8,"W 460 x 68,0"]
["W 460 x 74,0",74,457,190,9,14.5,428,404,94.9,164,33415,1462.4,18.77,1657.4,1661,174.8,4.18,271.3,4.93,52.97,6.55,44.89,0.92,811417,1.64,65.238095238095241,137,109.6,"W 460 x 74,0"]
["W 460 x 82,0",82,460,191,9.9,16,428,404,104.7,164,37157,1615.5,18.84,1836.4,1862,195,4.22,303.3,4.96,70.62,5.97,40.81,0.95,915745,1.64,76.19047619047619,160,128,"W 460 x 82,0"]
["W 460 x 89,0",89,463,192,10.5,17.7,428,404,114.1,165,41105,1775.6,18.98,2019.4,2093,218,4.28,339,5.01,92.49,5.42,38.44,0.96,1035073,1.65,86.19047619047619,181,144.80000000000001,"W 460 x 89,0"]
["W 460 x 97,0",97,466,193,11.4,19,428,404,123.4,166,44658,1916.7,19.03,2187.4,2283,236.6,4.3,368.8,5.03,115.05,5.08,35.44,1,1137180,1.66,99.047619047619037,208,166.4,"W 460 x 97,0"]
["W 460 x 106,0",106,469,194,12.6,20.6,428,404,135.1,167,48978,2088.6,19.04,2394.6,2515,259.3,4.32,405.7,5.05,148.19,4.71,32.049999999999997,1,1260063,1.67,110.47619047619047,232,185.6,"W 460 x 106,0"]
["W 530 x 66,0",66,525,165,8.9,11.4,502,478,83.6,167,34971,1332.2,20.46,1558,857,103.9,3.2,166,4.0199999999999996,31.52,7.24,53.73,0.84,562854,1.67,49.523809523809518,104,83.2,"W 530 x 66,0"]
["W 530 x 72,0",72,524,207,9,10.9,502,478,91.6,184,39969,1525.5,20.89,1755.9,1615,156,4.2,244.6,5.16,33.409999999999997,9.5,53.13,0.86,1060548,1.84,55.238095238095234,116,92.8,"W 530 x 72,0"]
["W 530 x 74,0",74,529,166,9.6999999999999993,13.6,502,478,95.1,168,40969,1548.9,20.76,1804.9,1041,125.5,3.31,200.1,4.0999999999999996,47.39,6.1,49.26,0.87,688558,1.68,61.428571428571423,129,103.2,"W 530 x 74,0"]
["W 530 x 82,0",82,528,209,9.5,13.3,501,477,104.5,185,47569,1801.8,21.34,2058.5,2028,194.1,4.41,302.7,5.31,51.23,7.86,50.25,0.88,1340255,1.85,68.095238095238088,143,114.4,"W 530 x 82,0"]
["W 530 x 85,0",85,535,166,10.3,16.5,502,478,107.7,169,48453,1811.3,21.21,2099.8000000000002,1263,152.19999999999999,3.42,241.6,4.17,72.930000000000007,5.03,46.41,0.9,845463,1.69,74.285714285714278,156,124.8,"W 530 x 85,0"]
["W 530 x 92,0",92,533,209,10.199999999999999,15.6,502,478,117.6,186,55157,2069.6999999999998,21.65,2359.8000000000002,2379,227.6,4.5,354.7,5.36,75.5,6.7,46.84,0.9,1588565,1.86,81.428571428571431,171,136.80000000000001,"W 530 x 92,0"]
["W 530 x 101,0",101,537,210,10.9,17.399999999999999,502,470,130,186,62198,2316.5,21.87,2640.4,2693,256.5,4.55,400.6,5.4,106.04,6.03,43.14,0.93,1812734,1.86,95.238095238095241,200,160,"W 530 x 101,0"]
["W 530 x 109,0",109,539,211,11.6,18.8,501,469,139.69999999999999,187,67226,2494.5,21.94,2847,2952,279.8,4.5999999999999996,437.4,5.44,131.38,5.61,40.47,0.95,1991291,1.87,106.19047619047619,223,178.4,"W 530 x 109,0"]
["W 610 x 101,0",101,603,228,10.5,14.9,573,541,130.30000000000001,207,77003,2554,24.31,2922.7,2951,258.8,4.76,405,5.76,81.680000000000007,7.65,51.54,0.87,2544966,2.0699999999999998,87.142857142857139,183,146.4,"W 610 x 101,0"]
["W 610 x 113,0",113,608,228,11.2,17.3,573,541,145.30000000000001,208,88196,2901.2,24.64,3312.9,3426,300.5,4.8600000000000003,469.7,5.82,116.5,6.59,48.34,0.9,2981078,2.08,102.85714285714285,216,172.8,"W 610 x 113,0"]
["W 610 x 125,0",125,612,229,11.9,19.600000000000001,573,541,160.1,209,99184,3241.3,24.89,3697.3,3933,343.5,4.96,536.29999999999995,5.89,159.5,5.84,45.45,0.91,3441766,2.09,118.57142857142857,249,199.2,"W 610 x 125,0"]
["W 610 x 140,0",140,617,230,13.1,22.2,573,541,179.3,210,112619,3650.5,25.06,4173.1000000000004,4515,392.6,5.0199999999999996,614,5.94,225.01,5.18,41.27,0.94,3981687,2.1,140,294,235.2,"W 610 x 140,0"]
["W 610 x 155,0",155,611,324,12.7,19,573,541,198.1,247,129583,4241.7,25.58,4749.1000000000004,10783,665.6,7.38,1022.6,8.5299999999999994,200.77,8.5299999999999994,42.6,0.94,9436714,2.4700000000000002,152.38095238095238,320,256,"W 610 x 155,0"]
["W 610 x 174,0",174,616,325,14,21.6,573,541,222.8,248,147754,4797.2,25.75,5383.3,12374,761.5,7.45,1171.0999999999999,8.58,286.88,7.52,38.630000000000003,0.96,10915665,2.48,180,378,302.39999999999998,"W 610 x 174,0"]

{"sheet":"Aços","index":9,"n_rows":4,"n_cols":2,"rows_kept":4,"cut":false,"hidden":false,"merged":[]}
["Aço","Fy"]
["ASTM A36",25]
["CF-26",25]
["ASTM A572GR50",34.5]